{"text_format":"1","workbook":"xlsx","n_sheets":5,"sheets":["formato_para_imprimir","F1","listas","Instructivo","Formato"],"not_rendered":{"charts":0,"images":6,"macros":1,"external_links":0,"defined_names":4,"comments":0,"pivot_tables":0},"unopened":[],"bounds":{"document_bytes":16777216,"sheet_cells":100000,"rows_first":2000,"rows_last":500,"rows_between":2000,"halvings":0,"cell_chars":16384,"cell_head_chars":4096},"cells_cut":0,"cells_raw":0,"read":"whole","date_system":"1900"}

{"sheet":"formato_para_imprimir","index":0,"n_rows":26,"n_cols":64,"rows_kept":26,"cut":false,"hidden":true,"merged":[[25,1,26,63],[17,9,17,27],[19,9,19,27],[21,9,21,27],[23,9,23,27],[10,1,10,12],[10,14,10,18],[4,1,4,63],[6,1,6,63],[7,1,7,63],[8,1,8,13],[8,14,8,26],[8,32,8,47],[8,56,8,62]]}
[{"$f":"+Formato!$AF$16","v":0}]
[{"$f":"+Formato!$AF$16","v":0}]
[]
[]
[null,"REGISTRO ÚNICO DE BENEFICIARIOS FINALES - RUB\nRESOLUCIÓN 164 DE 2021 DIAN"]
[]
[null,"Dando cumplimiento a la Resolución 164 del 27 de diciembre del 2021 expedida por la Dirección de Impuestos y Aduanas Nacionales (DIAN), mediante la cual se crea el Registro Único de Beneficiarios Finales (RUB), por favor diligencie los siguientes campos, con el fin de efectuar el reporte electrónico correspondiente a través de los sistemas informáticos de dicha entidad:"]
[]
[null,"Tipo de producto que posee con la entidad",null,null,null,null,null,null,null,null,null,null,null,null,{"$f":"+Formato!$C$10","v":0},null,null,null,null,null,null,null,null,null,null,null,null,null,null,null,null,"Nombre del Producto",{"$f":"+Formato!$C$12","v":0},null,null,null,null,null,null,null,null,null,null,null,null,null,null,null,null,"Fecha Diligenciamiento   ",null,null,null,null,null,null,{"$f":"+TODAY()","v":"2023-09-06"}]
[]
[null,"NIESPJ  ",null,null,null,null,null,null,null,null,null,null,null,null,null,null,null,null,null,null,null,null,null,null,null,null,null,null,null,null,null,null,null,null,null,null,null,null,null,null,null,null,null,null,null,null,null,null,null,null,null,null,null,null,null,null,null,null,null,null,null,null,null,1]
[null,1,1]
[]
[]
[]
[null,"Firma"]
[]
[null,"Nombre",null,null,null,null,null,null,null,{"$f":"+IF(Formato!$C$14=\"\",\"\",Formato!$C$14)","v":""}]
[]
[null,"Número de identificación",null,null,null,null,null,null,null,{"$f":"+IF(Formato!$G$14=\"\",\"\",Formato!$G$14)","v":""}]
[]
[null,"Actuando en calidad de",null,null,null,null,null,null,null,{"$f":"+IF(Formato!$J$14=\"\",\"\",Formato!$J$14)","v":""}]
[]
[null,"Cual",null,null,null,null,null,null,null,{"$f":"+IF(Formato!$L$14=\"\",\"\",Formato!$L$14)","v":""}]
[]
[null,"NOTA: Tenga en cuenta que:\n1. Si la cantidad de beneficiarios finales supera los registrados en este documento, debe imprimir un nuevo formato indicando en el encabezado que corresponde a la continuación del diligenciado inicialmente.\n2. Ante cualquier modificación de la información aquí suministrada, debe efectuar su respectiva actualización mediante el diligenciamiento de un nuevo formato. "]

{"sheet":"F1","index":1,"n_rows":2626,"n_cols":64,"rows_kept":2626,"cut":false,"hidden":true,"merged":[[2611,2,2611,8],[2611,10,2611,14],[2607,2,2607,9],[2607,10,2607,14],[2607,15,2607,27],[2607,28,2607,62],[2609,1,2609,9],[2609,10,2609,14],[2609,15,2609,27],[2609,28,2609,31],[2609,33,2609,57],[2609,58,2609,62],[2603,1,2603,63],[2605,1,2605,9],[2605,10,2605,14],[2605,16,2605,23],[2605,25,2605,27],[2605,29,2605,34],[2605,37,2605,38],[2605,40,2605,57],[2605,59,2605,62],[2599,44,2599,50],[2599,51,2599,61],[2601,19,2601,22],[2601,23,2601,29],[2601,30,2601,36],[2601,37,2601,61],[2597,51,2597,61],[2598,19,2598,20],[2598,22,2598,23],[2598,25,2598,26],[2599,1,2599,3],[2599,4,2599,18],[2599,19,2599,22],[2599,23,2599,29],[2599,34,2599,36],[2599,37,2599,43],[2594,1,2594,63],[2595,11,2595,18],[2595,19,2595,27],[2595,28,2595,33],[2595,34,2595,43],[2597,12,2597,18],[2597,19,2597,27],[2597,28,2597,32],[2597,34,2597,43],[2597,45,2597,50],[2591,45,2591,50],[2591,51,2591,61],[2592,1,2592,63],[2593,1,2593,7],[2593,8,2593,13],[2593,14,2593,18],[2593,19,2593,27],[2593,28,2593,32],[2593,34,2593,43],[2591,1,2591,5],[2591,6,2591,13],[2591,14,2591,18],[2591,19,2591,27],[2591,28,2591,33],[2591,34,2591,43],[2585,2,2585,8],[2585,10,2585,14],[2586,1,2586,63],[2587,1,2587,63],[2589,1,2589,13],[2589,14,2589,43],[2589,48,2589,50],[2589,51,2589,57],[2581,2,2581,9],[2581,10,2581,14],[2581,15,2581,27],[2581,28,2581,62],[2583,1,2583,9],[2583,10,2583,14],[2583,15,2583,27],[2583,28,2583,31],[2583,33,2583,57],[2583,58,2583,62],[2577,1,2577,63],[2579,1,2579,9],[2579,10,2579,14],[2579,16,2579,23],[2579,25,2579,27],[2579,29,2579,34],[2579,37,2579,38],[2579,40,2579,57],[2579,59,2579,62],[2573,44,2573,50],[2573,51,2573,61],[2575,19,2575,22],[2575,23,2575,29],[2575,30,2575,36],[2575,37,2575,61],[2571,51,2571,61],[2572,19,2572,20],[2572,22,2572,23],[2572,25,2572,26],[2573,1,2573,3],[2573,4,2573,18],[2573,19,2573,22],[2573,23,2573,29],[2573,34,2573,36],[2573,37,2573,43],[2568,1,2568,63],[2569,11,2569,18],[2569,19,2569,27],[2569,28,2569,33],[2569,34,2569,43],[2571,12,2571,18],[2571,19,2571,27],[2571,28,2571,32],[2571,34,2571,43],[2571,45,2571,50],[2565,45,2565,50],[2565,51,2565,61],[2566,1,2566,63],[2567,1,2567,7],[2567,8,2567,13],[2567,14,2567,18],[2567,19,2567,27],[2567,28,2567,32],[2567,34,2567,43],[2565,1,2565,5],[2565,6,2565,13],[2565,14,2565,18],[2565,19,2565,27],[2565,28,2565,33],[2565,34,2565,43],[2559,2,2559,8],[2559,10,2559,14],[2560,1,2560,63],[2561,1,2561,63],[2563,1,2563,13],[2563,14,2563,43],[2563,48,2563,50],[2563,51,2563,57],[2555,2,2555,9],[2555,10,2555,14],[2555,15,2555,27],[2555,28,2555,62],[2557,1,2557,9],[2557,10,2557,14],[2557,15,2557,27],[2557,28,2557,31],[2557,33,2557,57],[2557,58,2557,62],[2551,1,2551,63],[2553,1,2553,9],[2553,10,2553,14],[2553,16,2553,23],[2553,25,2553,27],[2553,29,2553,34],[2553,37,2553,38],[2553,40,2553,57],[2553,59,2553,62],[2547,44,2547,50],[2547,51,2547,61],[2549,19,2549,22],[2549,23,2549,29],[2549,30,2549,36],[2549,37,2549,61],[2545,51,2545,61],[2546,19,2546,20],[2546,22,2546,23],[2546,25,2546,26],[2547,1,2547,3],[2547,4,2547,18],[2547,19,2547,22],[2547,23,2547,29],[2547,34,2547,36],[2547,37,2547,43],[2542,1,2542,63],[2543,11,2543,18],[2543,19,2543,27],[2543,28,2543,33],[2543,34,2543,43],[2545,12,2545,18],[2545,19,2545,27],[2545,28,2545,32],[2545,34,2545,43],[2545,45,2545,50],[2539,45,2539,50],[2539,51,2539,61],[2540,1,2540,63],[2541,1,2541,7],[2541,8,2541,13],[2541,14,2541,18],[2541,19,2541,27],[2541,28,2541,32],[2541,34,2541,43],[2539,1,2539,5],[2539,6,2539,13],[2539,14,2539,18],[2539,19,2539,27],[2539,28,2539,33],[2539,34,2539,43],[2533,2,2533,8],[2533,10,2533,14],[2534,1,2534,63],[2535,1,2535,63],[2537,1,2537,13],[2537,14,2537,43],[2537,48,2537,50],[2537,51,2537,57],[2529,2,2529,9],[2529,10,2529,14],[2529,15,2529,27],[2529,28,2529,62],[2531,1,2531,9],[2531,10,2531,14],[2531,15,2531,27],[2531,28,2531,31],[2531,33,2531,57],[2531,58,2531,62],[2525,1,2525,63],[2527,1,2527,9],[2527,10,2527,14],[2527,16,2527,23],[2527,25,2527,27],[2527,29,2527,34],[2527,37,2527,38],[2527,40,2527,57],[2527,59,2527,62],[2521,44,2521,50],[2521,51,2521,61],[2523,19,2523,22],[2523,23,2523,29],[2523,30,2523,36],[2523,37,2523,61],[2519,51,2519,61],[2520,19,2520,20],[2520,22,2520,23],[2520,25,2520,26],[2521,1,2521,3],[2521,4,2521,18],[2521,19,2521,22],[2521,23,2521,29],[2521,34,2521,36],[2521,37,2521,43],[2516,1,2516,63],[2517,11,2517,18],[2517,19,2517,27],[2517,28,2517,33],[2517,34,2517,43],[2519,12,2519,18],[2519,19,2519,27],[2519,28,2519,32],[2519,34,2519,43],[2519,45,2519,50],[2513,45,2513,50],[2513,51,2513,61],[2514,1,2514,63],[2515,1,2515,7],[2515,8,2515,13],[2515,14,2515,18],[2515,19,2515,27],[2515,28,2515,32],[2515,34,2515,43],[2513,1,2513,5],[2513,6,2513,13],[2513,14,2513,18],[2513,19,2513,27],[2513,28,2513,33],[2513,34,2513,43],[2507,2,2507,8],[2507,10,2507,14],[2508,1,2508,63],[2509,1,2509,63],[2511,1,2511,13],[2511,14,2511,43],[2511,48,2511,50],[2511,51,2511,57],[2503,2,2503,9],[2503,10,2503,14],[2503,15,2503,27],[2503,28,2503,62],[2505,1,2505,9],[2505,10,2505,14],[2505,15,2505,27],[2505,28,2505,31],[2505,33,2505,57],[2505,58,2505,62],[2499,1,2499,63],[2501,1,2501,9],[2501,10,2501,14],[2501,16,2501,23],[2501,25,2501,27],[2501,29,2501,34],[2501,37,2501,38],[2501,40,2501,57],[2501,59,2501,62],[2495,44,2495,50],[2495,51,2495,61],[2497,19,2497,22],[2497,23,2497,29],[2497,30,2497,36],[2497,37,2497,61],[2493,51,2493,61],[2494,19,2494,20],[2494,22,2494,23],[2494,25,2494,26],[2495,1,2495,3],[2495,4,2495,18],[2495,19,2495,22],[2495,23,2495,29],[2495,34,2495,36],[2495,37,2495,43],[2490,1,2490,63],[2491,11,2491,18],[2491,19,2491,27],[2491,28,2491,33],[2491,34,2491,43],[2493,12,2493,18],[2493,19,2493,27],[2493,28,2493,32],[2493,34,2493,43],[2493,45,2493,50],[2487,45,2487,50],[2487,51,2487,61],[2488,1,2488,63],[2489,1,2489,7],[2489,8,2489,13],[2489,14,2489,18],[2489,19,2489,27],[2489,28,2489,32],[2489,34,2489,43],[2487,1,2487,5],[2487,6,2487,13],[2487,14,2487,18],[2487,19,2487,27],[2487,28,2487,33],[2487,34,2487,43],[2481,2,2481,8],[2481,10,2481,14],[2482,1,2482,63],[2483,1,2483,63],[2485,1,2485,13],[2485,14,2485,43],[2485,48,2485,50],[2485,51,2485,57],[2477,2,2477,9],[2477,10,2477,14],[2477,15,2477,27],[2477,28,2477,62],[2479,1,2479,9],[2479,10,2479,14],[2479,15,2479,27],[2479,28,2479,31],[2479,33,2479,57],[2479,58,2479,62],[2473,1,2473,63],[2475,1,2475,9],[2475,10,2475,14],[2475,16,2475,23],[2475,25,2475,27],[2475,29,2475,34],[2475,37,2475,38],[2475,40,2475,57],[2475,59,2475,62],[2469,44,2469,50],[2469,51,2469,61],[2471,19,2471,22],[2471,23,2471,29],[2471,30,2471,36],[2471,37,2471,61],[2467,51,2467,61],[2468,19,2468,20],[2468,22,2468,23],[2468,25,2468,26],[2469,1,2469,3],[2469,4,2469,18],[2469,19,2469,22],[2469,23,2469,29],[2469,34,2469,36],[2469,37,2469,43],[2464,1,2464,63],[2465,11,2465,18],[2465,19,2465,27],[2465,28,2465,33],[2465,34,2465,43],[2467,12,2467,18],[2467,19,2467,27],[2467,28,2467,32],[2467,34,2467,43],[2467,45,2467,50],[2461,45,2461,50],[2461,51,2461,61],[2462,1,2462,63],[2463,1,2463,7],[2463,8,2463,13],[2463,14,2463,18],[2463,19,2463,27],[2463,28,2463,32],[2463,34,2463,43],[2461,1,2461,5],[2461,6,2461,13],[2461,14,2461,18],[2461,19,2461,27],[2461,28,2461,33],[2461,34,2461,43],[2455,2,2455,8],[2455,10,2455,14],[2456,1,2456,63],[2457,1,2457,63],[2459,1,2459,13],[2459,14,2459,43],[2459,48,2459,50],[2459,51,2459,57],[2451,2,2451,9],[2451,10,2451,14],[2451,15,2451,27],[2451,28,2451,62],[2453,1,2453,9],[2453,10,2453,14],[2453,15,2453,27],[2453,28,2453,31],[2453,33,2453,57],[2453,58,2453,62],[2447,1,2447,63],[2449,1,2449,9],[2449,10,2449,14],[2449,16,2449,23],[2449,25,2449,27],[2449,29,2449,34],[2449,37,2449,38],[2449,40,2449,57],[2449,59,2449,62],[2443,44,2443,50],[2443,51,2443,61],[2445,19,2445,22],[2445,23,2445,29],[2445,30,2445,36],[2445,37,2445,61],[2441,51,2441,61],[2442,19,2442,20],[2442,22,2442,23],[2442,25,2442,26],[2443,1,2443,3],[2443,4,2443,18],[2443,19,2443,22],[2443,23,2443,29],[2443,34,2443,36],[2443,37,2443,43],[2438,1,2438,63],[2439,11,2439,18],[2439,19,2439,27],[2439,28,2439,33],[2439,34,2439,43],[2441,12,2441,18],[2441,19,2441,27],[2441,28,2441,32],[2441,34,2441,43],[2441,45,2441,50],[2435,45,2435,50],[2435,51,2435,61],[2436,1,2436,63],[2437,1,2437,7],[2437,8,2437,13],[2437,14,2437,18],[2437,19,2437,27],[2437,28,2437,32],[2437,34,2437,43],[2435,1,2435,5],[2435,6,2435,13],[2435,14,2435,18],[2435,19,2435,27],[2435,28,2435,33],[2435,34,2435,43],[2429,2,2429,8],[2429,10,2429,14],[2430,1,2430,63],[2431,1,2431,63],[2433,1,2433,13],[2433,14,2433,43],[2433,48,2433,50],[2433,51,2433,57],[2425,2,2425,9],[2425,10,2425,14],[2425,15,2425,27],[2425,28,2425,62],[2427,1,2427,9],[2427,10,2427,14],[2427,15,2427,27],[2427,28,2427,31],[2427,33,2427,57],[2427,58,2427,62],[2421,1,2421,63],[2423,1,2423,9],[2423,10,2423,14],[2423,16,2423,23],[2423,25,2423,27],[2423,29,2423,34],[2423,37,2423,38],[2423,40,2423,57],[2423,59,2423,62],[2417,44,2417,50],[2417,51,2417,61],[2419,19,2419,22],[2419,23,2419,29],[2419,30,2419,36],[2419,37,2419,61],[2415,51,2415,61],[2416,19,2416,20],[2416,22,2416,23],[2416,25,2416,26],[2417,1,2417,3],[2417,4,2417,18],[2417,19,2417,22],[2417,23,2417,29],[2417,34,2417,36],[2417,37,2417,43],[2412,1,2412,63],[2413,11,2413,18],[2413,19,2413,27],[2413,28,2413,33],[2413,34,2413,43],[2415,12,2415,18],[2415,19,2415,27],[2415,28,2415,32],[2415,34,2415,43],[2415,45,2415,50],[2409,45,2409,50],[2409,51,2409,61],[2410,1,2410,63],[2411,1,2411,7],[2411,8,2411,13],[2411,14,2411,18],[2411,19,2411,27],[2411,28,2411,32],[2411,34,2411,43],[2409,1,2409,5],[2409,6,2409,13],[2409,14,2409,18],[2409,19,2409,27],[2409,28,2409,33],[2409,34,2409,43],[2403,2,2403,8],[2403,10,2403,14],[2404,1,2404,63],[2405,1,2405,63],[2407,1,2407,13],[2407,14,2407,43],[2407,48,2407,50],[2407,51,2407,57],[2399,2,2399,9],[2399,10,2399,14],[2399,15,2399,27],[2399,28,2399,62],[2401,1,2401,9],[2401,10,2401,14],[2401,15,2401,27],[2401,28,2401,31],[2401,33,2401,57],[2401,58,2401,62],[2395,1,2395,63],[2397,1,2397,9],[2397,10,2397,14],[2397,16,2397,23],[2397,25,2397,27],[2397,29,2397,34],[2397,37,2397,38],[2397,40,2397,57],[2397,59,2397,62],[2391,44,2391,50],[2391,51,2391,61],[2393,19,2393,22],[2393,23,2393,29],[2393,30,2393,36],[2393,37,2393,61],[2389,51,2389,61],[2390,19,2390,20],[2390,22,2390,23],[2390,25,2390,26],[2391,1,2391,3],[2391,4,2391,18],[2391,19,2391,22],[2391,23,2391,29],[2391,34,2391,36],[2391,37,2391,43],[2386,1,2386,63],[2387,11,2387,18],[2387,19,2387,27],[2387,28,2387,33],[2387,34,2387,43],[2389,12,2389,18],[2389,19,2389,27],[2389,28,2389,32],[2389,34,2389,43],[2389,45,2389,50],[2383,45,2383,50],[2383,51,2383,61],[2384,1,2384,63],[2385,1,2385,7],[2385,8,2385,13],[2385,14,2385,18],[2385,19,2385,27],[2385,28,2385,32],[2385,34,2385,43],[2383,1,2383,5],[2383,6,2383,13],[2383,14,2383,18],[2383,19,2383,27],[2383,28,2383,33],[2383,34,2383,43],[2377,2,2377,8],[2377,10,2377,14],[2378,1,2378,63],[2379,1,2379,63],[2381,1,2381,13],[2381,14,2381,43],[2381,48,2381,50],[2381,51,2381,57],[2373,2,2373,9],[2373,10,2373,14],[2373,15,2373,27],[2373,28,2373,62],[2375,1,2375,9],[2375,10,2375,14],[2375,15,2375,27],[2375,28,2375,31],[2375,33,2375,57],[2375,58,2375,62],[2369,1,2369,63],[2371,1,2371,9],[2371,10,2371,14],[2371,16,2371,23],[2371,25,2371,27],[2371,29,2371,34],[2371,37,2371,38],[2371,40,2371,57],[2371,59,2371,62],[2365,44,2365,50],[2365,51,2365,61],[2367,19,2367,22],[2367,23,2367,29],[2367,30,2367,36],[2367,37,2367,61],[2363,51,2363,61],[2364,19,2364,20],[2364,22,2364,23],[2364,25,2364,26],[2365,1,2365,3],[2365,4,2365,18],[2365,19,2365,22],[2365,23,2365,29],[2365,34,2365,36],[2365,37,2365,43],[2360,1,2360,63],[2361,11,2361,18],[2361,19,2361,27],[2361,28,2361,33],[2361,34,2361,43],[2363,12,2363,18],[2363,19,2363,27],[2363,28,2363,32],[2363,34,2363,43],[2363,45,2363,50],[2357,45,2357,50],[2357,51,2357,61],[2358,1,2358,63],[2359,1,2359,7],[2359,8,2359,13],[2359,14,2359,18],[2359,19,2359,27],[2359,28,2359,32],[2359,34,2359,43],[2357,1,2357,5],[2357,6,2357,13],[2357,14,2357,18],[2357,19,2357,27],[2357,28,2357,33],[2357,34,2357,43],[2351,2,2351,8],[2351,10,2351,14],[2352,1,2352,63],[2353,1,2353,63],[2355,1,2355,13],[2355,14,2355,43],[2355,48,2355,50],[2355,51,2355,57],[2347,2,2347,9],[2347,10,2347,14],[2347,15,2347,27],[2347,28,2347,62],[2349,1,2349,9],[2349,10,2349,14],[2349,15,2349,27],[2349,28,2349,31],[2349,33,2349,57],[2349,58,2349,62],[2343,1,2343,63],[2345,1,2345,9],[2345,10,2345,14],[2345,16,2345,23],[2345,25,2345,27],[2345,29,2345,34],[2345,37,2345,38],[2345,40,2345,57],[2345,59,2345,62],[2339,44,2339,50],[2339,51,2339,61],[2341,19,2341,22],[2341,23,2341,29],[2341,30,2341,36],[2341,37,2341,61],[2337,51,2337,61],[2338,19,2338,20],[2338,22,2338,23],[2338,25,2338,26],[2339,1,2339,3],[2339,4,2339,18],[2339,19,2339,22],[2339,23,2339,29],[2339,34,2339,36],[2339,37,2339,43],[2334,1,2334,63],[2335,11,2335,18],[2335,19,2335,27],[2335,28,2335,33],[2335,34,2335,43],[2337,12,2337,18],[2337,19,2337,27],[2337,28,2337,32],[2337,34,2337,43],[2337,45,2337,50],[2331,45,2331,50],[2331,51,2331,61],[2332,1,2332,63],[2333,1,2333,7],[2333,8,2333,13],[2333,14,2333,18],[2333,19,2333,27],[2333,28,2333,32],[2333,34,2333,43],[2331,1,2331,5],[2331,6,2331,13],[2331,14,2331,18],[2331,19,2331,27],[2331,28,2331,33],[2331,34,2331,43],[2325,2,2325,8],[2325,10,2325,14],[2326,1,2326,63],[2327,1,2327,63],[2329,1,2329,13],[2329,14,2329,43],[2329,48,2329,50],[2329,51,2329,57],[2321,2,2321,9],[2321,10,2321,14],[2321,15,2321,27],[2321,28,2321,62],[2323,1,2323,9],[2323,10,2323,14],[2323,15,2323,27],[2323,28,2323,31],[2323,33,2323,57],[2323,58,2323,62],[2317,1,2317,63],[2319,1,2319,9],[2319,10,2319,14],[2319,16,2319,23],[2319,25,2319,27],[2319,29,2319,34],[2319,37,2319,38],[2319,40,2319,57],[2319,59,2319,62],[2313,44,2313,50],[2313,51,2313,61],[2315,19,2315,22],[2315,23,2315,29],[2315,30,2315,36],[2315,37,2315,61],[2311,51,2311,61],[2312,19,2312,20],[2312,22,2312,23],[2312,25,2312,26],[2313,1,2313,3],[2313,4,2313,18],[2313,19,2313,22],[2313,23,2313,29],[2313,34,2313,36],[2313,37,2313,43],[2308,1,2308,63],[2309,11,2309,18],[2309,19,2309,27],[2309,28,2309,33],[2309,34,2309,43],[2311,12,2311,18],[2311,19,2311,27],[2311,28,2311,32],[2311,34,2311,43],[2311,45,2311,50],[2305,45,2305,50],[2305,51,2305,61],[2306,1,2306,63],[2307,1,2307,7],[2307,8,2307,13],[2307,14,2307,18],[2307,19,2307,27],[2307,28,2307,32],[2307,34,2307,43],[2305,1,2305,5],[2305,6,2305,13],[2305,14,2305,18],[2305,19,2305,27],[2305,28,2305,33],[2305,34,2305,43],[2299,2,2299,8],[2299,10,2299,14],[2300,1,2300,63],[2301,1,2301,63],[2303,1,2303,13],[2303,14,2303,43],[2303,48,2303,50],[2303,51,2303,57],[2295,2,2295,9],[2295,10,2295,14],[2295,15,2295,27],[2295,28,2295,62],[2297,1,2297,9],[2297,10,2297,14],[2297,15,2297,27],[2297,28,2297,31],[2297,33,2297,57],[2297,58,2297,62],[2291,1,2291,63],[2293,1,2293,9],[2293,10,2293,14],[2293,16,2293,23],[2293,25,2293,27],[2293,29,2293,34],[2293,37,2293,38],[2293,40,2293,57],[2293,59,2293,62],[2287,44,2287,50],[2287,51,2287,61],[2289,19,2289,22],[2289,23,2289,29],[2289,30,2289,36],[2289,37,2289,61],[2285,51,2285,61],[2286,19,2286,20],[2286,22,2286,23],[2286,25,2286,26],[2287,1,2287,3],[2287,4,2287,18],[2287,19,2287,22],[2287,23,2287,29],[2287,34,2287,36],[2287,37,2287,43],[2282,1,2282,63],[2283,11,2283,18],[2283,19,2283,27],[2283,28,2283,33],[2283,34,2283,43],[2285,12,2285,18],[2285,19,2285,27],[2285,28,2285,32],[2285,34,2285,43],[2285,45,2285,50],[2279,45,2279,50],[2279,51,2279,61],[2280,1,2280,63],[2281,1,2281,7],[2281,8,2281,13],[2281,14,2281,18],[2281,19,2281,27],[2281,28,2281,32],[2281,34,2281,43],[2279,1,2279,5],[2279,6,2279,13],[2279,14,2279,18],[2279,19,2279,27],[2279,28,2279,33],[2279,34,2279,43],[2273,2,2273,8],[2273,10,2273,14],[2274,1,2274,63],[2275,1,2275,63],[2277,1,2277,13],[2277,14,2277,43],[2277,48,2277,50],[2277,51,2277,57],[2269,2,2269,9],[2269,10,2269,14],[2269,15,2269,27],[2269,28,2269,62],[2271,1,2271,9],[2271,10,2271,14],[2271,15,2271,27],[2271,28,2271,31],[2271,33,2271,57],[2271,58,2271,62],[2265,1,2265,63],[2267,1,2267,9],[2267,10,2267,14],[2267,16,2267,23],[2267,25,2267,27],[2267,29,2267,34],[2267,37,2267,38],[2267,40,2267,57],[2267,59,2267,62],[2261,44,2261,50],[2261,51,2261,61],[2263,19,2263,22],[2263,23,2263,29],[2263,30,2263,36],[2263,37,2263,61],[2259,51,2259,61],[2260,19,2260,20],[2260,22,2260,23],[2260,25,2260,26],[2261,1,2261,3],[2261,4,2261,18],[2261,19,2261,22],[2261,23,2261,29],[2261,34,2261,36],[2261,37,2261,43],[2256,1,2256,63],[2257,11,2257,18],[2257,19,2257,27],[2257,28,2257,33],[2257,34,2257,43],[2259,12,2259,18],[2259,19,2259,27],[2259,28,2259,32],[2259,34,2259,43],[2259,45,2259,50],[2253,45,2253,50],[2253,51,2253,61],[2254,1,2254,63],[2255,1,2255,7],[2255,8,2255,13],[2255,14,2255,18],[2255,19,2255,27],[2255,28,2255,32],[2255,34,2255,43],[2253,1,2253,5],[2253,6,2253,13],[2253,14,2253,18],[2253,19,2253,27],[2253,28,2253,33],[2253,34,2253,43],[2247,2,2247,8],[2247,10,2247,14],[2248,1,2248,63],[2249,1,2249,63],[2251,1,2251,13],[2251,14,2251,43],[2251,48,2251,50],[2251,51,2251,57],[2243,2,2243,9],[2243,10,2243,14],[2243,15,2243,27],[2243,28,2243,62],[2245,1,2245,9],[2245,10,2245,14],[2245,15,2245,27],[2245,28,2245,31],[2245,33,2245,57],[2245,58,2245,62],[2239,1,2239,63],[2241,1,2241,9],[2241,10,2241,14],[2241,16,2241,23],[2241,25,2241,27],[2241,29,2241,34],[2241,37,2241,38],[2241,40,2241,57],[2241,59,2241,62],[2235,44,2235,50],[2235,51,2235,61],[2237,19,2237,22],[2237,23,2237,29],[2237,30,2237,36],[2237,37,2237,61],[2233,51,2233,61],[2234,19,2234,20],[2234,22,2234,23],[2234,25,2234,26],[2235,1,2235,3],[2235,4,2235,18],[2235,19,2235,22],[2235,23,2235,29],[2235,34,2235,36],[2235,37,2235,43],[2230,1,2230,63],[2231,11,2231,18],[2231,19,2231,27],[2231,28,2231,33],[2231,34,2231,43],[2233,12,2233,18],[2233,19,2233,27],[2233,28,2233,32],[2233,34,2233,43],[2233,45,2233,50],[2227,45,2227,50]],"merged_total":6814,"flags":["merged_cut"]}
[{"$f":"+Formato!$AF$16","v":0}]
[{"$f":"+Formato!$AF$16","v":0}]
[]
[]
[null,"REGISTRO ÚNICO DE BENEFICIARIOS FINALES - RUB\nRESOLUCIÓN 164 DE 2021 DIAN"]
[]
[null,"Dando cumplimiento a la Resolución 164 del 27 de diciembre del 2021 expedida por la Dirección de Impuestos y Aduanas Nacionales (DIAN), mediante la cual se crea el Registro Único de Beneficiarios Finales (RUB), por favor diligencie los siguientes campos, con el fin de efectuar el reporte electrónico correspondiente a través de los sistemas informáticos de dicha entidad:"]
[]
[null,"Tipo de producto que posee con la entidad",null,null,null,null,null,null,null,null,null,null,null,null,{"$f":"+Formato!$C$10","v":0},null,null,null,null,null,null,null,null,null,null,null,null,null,null,null,null,"Nombre del Producto",{"$f":"+Formato!$C$12","v":0},null,null,null,null,null,null,null,null,null,null,null,null,null,null,null,null,"Fecha Diligenciamiento   ",null,null,null,null,null,null,{"$f":"+TODAY()","v":"2023-09-06"}]
[]
[null,"NIESPJ  ",null,null,null,null,null,null,null,null,null,null,null,null,null,null,null,null,null,null,null,null,null,null,null,null,null,null,null,null,null,null,null,null,null,null,null,null,null,null,null,null,null,null,null,null,null,null,null,null,null,null,null,null,null,null,null,null,null,null,null,null,null,1]
[null,1,1]
[null,"Beneficiario 1."]
[null,"Datos de los Beneficiarios Finales"]
[]
[null,"Nombre de la Empresa o Razón Social",null,null,null,null,null,null,null,null,null,null,null,null,null,null,null,null,null,null,null,null,null,null,null,null,null,null,null,null,null,null,null,null,null,null,null,null,null,null,null,null,null,null,null,null,null,null,"NIT - DV",null,null,null,null,null,null,null,null,null,null,"-"]
[]
[null,"Primer Nombre",null,null,null,null,null,null,null,null,null,null,null,null,"Otros Nombres",null,null,null,null,null,null,null,null,null,null,null,null,null,"Primer Apellido",null,null,null,null,null,null,null,null,null,null,null,null,null,null,null,null,"Segundo Apellido"]
[]
[null,"Tipo de Documento",null,null,null,null,null,null,null,null,null,null,null,null,"Número de identificación",null,null,null,null,null,null,null,null,null,null,null,null,null,"País de Expedición de Identificación",null,null,null,null,null,null,null,null,null,null,null,null,null,null,null,null,null,null,null,null,null,null,"pinzon"]
[]
[null,null,null,null,null,null,null,null,null,null,null,"Número de identificación Tributaria (NIT)",null,null,null,null,null,null,null,null,null,null,null,null,null,null,null,null,"País Expedición (NIT)"]
[]
[null,null,null,null,null,null,null,null,null,null,null,null,"Fecha de Nacimiento (PN)",null,null,null,null,null,null,null,null,null,null,null,null,null,null,null,"País de Nacimiento ",null,null,null,null,null,null,null,null,null,null,null,null,null,null,null,null,"País de Nacionalidad"]
[]
[null,"Dirección Residencia",null,null,null,null,null,null,null,null,null,null,null,null,null,null,null,null,null,"Departamento",null,null,null,null,null,null,null,null,null,null,null,null,null,null,"Municipio",null,null,null,null,null,null,null,null,null,"País de Residencia"]
[]
[null,null,null,null,null,null,null,null,null,null,null,null,null,null,null,null,null,null,null,"Código Postal",null,null,null,null,null,null,null,null,null,null,"Correo electrónico"]
[]
[null,"Beneficiario final de la estructura sin personería jurídica"]
[]
[null,"Fiduciante / Fideicomitente / Constituyente o posición similar o equivalente",null,null,null,null,null,null,null,null,null,null,null,null,null,null,"Comité financiero o posición similar o equivalente",null,null,null,null,null,null,null,null,null,null,null,null,"Fideicomisario / Beneficiario",null,null,null,null,null,null,null,null,null,null,"Ejerce control final y/o efectivo o tiene derecho a gozar y/o disponer de los activos, beneficios, resultados o utilidades"]
[]
[null,null,"Beneficiario Condicionado",null,null,null,null,null,null,null,{"$f":"+IF(AC34=\"\",\"N\",\"S\")","v":"N"},null,null,null,null,"Condiciones que se deben cumplir para tener la calidad de beneficiario final - (Beneficiario Condicionado)"]
[]
[null,"Participación en el capital de la persona jurídica (%)",null,null,null,null,null,null,null,null,null,null,null,null,null,"Fecha desde la cual tiene la calidad de ben. final o existe la condición",null,null,null,null,null,null,null,null,null,null,null,null,null,null,null,null,null,"Fecha desde la cual deja de tener la calidad de ben. final o de existir la condición"]
[]
[null,{"$f":"+B12+1","v":2},"Tipo Novedad"]
[null,{"$f":"+\"Beneficiario \"&B38&\".\"","v":"Beneficiario 2."}]
[null,"Datos de los Beneficiarios Finales"]
[]
[null,"Nombre de la Empresa o Razón Social",null,null,null,null,null,null,null,null,null,null,null,null,null,null,null,null,null,null,null,null,null,null,null,null,null,null,null,null,null,null,null,null,null,null,null,null,null,null,null,null,null,null,null,null,null,null,"NIT - DV",null,null,null,null,null,null,null,null,null,null,"-"]
[]
[null,"Primer Nombre",null,null,null,null,null,null,null,null,null,null,null,null,"Otros Nombres",null,null,null,null,null,null,null,null,null,null,null,null,null,"Primer Apellido",null,null,null,null,null,null,null,null,null,null,null,null,null,null,null,null,"Segundo Apellido"]
[]
[null,"Tipo de Documento",null,null,null,null,null,null,null,null,null,null,null,null,"Número de identificación",null,null,null,null,null,null,null,null,null,null,null,null,null,"País de Expedición de Identificación"]
[]
[null,null,null,null,null,null,null,null,null,null,null,"Número de identificación Tributaria (NIT)",null,null,null,null,null,null,null,null,null,null,null,null,null,null,null,null,"País Expedición (NIT)"]
[]
[null,null,null,null,null,null,null,null,null,null,null,null,"Fecha de Nacimiento (PN)",null,null,null,null,null,null,null,null,null,null,null,null,null,null,null,"País de Nacimiento ",null,null,null,null,null,null,null,null,null,null,null,null,null,null,null,null,"País de Nacionalidad"]
[]
[null,"Dirección Residencia",null,null,null,null,null,null,null,null,null,null,null,null,null,null,null,null,null,"Departamento",null,null,null,null,null,null,null,null,null,null,null,null,null,null,"Municipio",null,null,null,null,null,null,null,null,null,"País de Residencia"]
[]
[null,null,null,null,null,null,null,null,null,null,null,null,null,null,null,null,null,null,null,"Código Postal",null,null,null,null,null,null,null,null,null,null,"Correo electrónico"]
[]
[null,"Beneficiario final de la estructura sin personería jurídica"]
[]
[null,"Fiduciante / Fideicomitente / Constituyente o posición similar o equivalente",null,null,null,null,null,null,null,null,null,null,null,null,null,null,"Comité financiero o posición similar o equivalente",null,null,null,null,null,null,null,null,null,null,null,null,"Fideicomisario / Beneficiario",null,null,null,null,null,null,null,null,null,null,"Ejerce control final y/o efectivo o tiene derecho a gozar y/o disponer de los activos, beneficios, resultados o utilidades"]
[]
[null,null,"Beneficiario Condicionado",null,null,null,null,null,null,null,{"$f":"+IF(AC60=\"\",\"N\",\"S\")","v":"N"},null,null,null,null,"Condiciones que se deben cumplir para tener la calidad de beneficiario final - (Beneficiario Condicionado)"]
[]
[null,"Participación en el capital de la persona jurídica (%)",null,null,null,null,null,null,null,null,null,null,null,null,null,"Fecha desde la cual tiene la calidad de ben. final o existe la condición",null,null,null,null,null,null,null,null,null,null,null,null,null,null,null,null,null,"Fecha desde la cual deja de tener la calidad de ben. final o de existir la condición"]
[]
[null,{"$f":"+B38+1","v":3},"Tipo Novedad"]
[null,{"$f":"+\"Beneficiario \"&B64&\".\"","v":"Beneficiario 3."}]
[null,"Datos de los Beneficiarios Finales"]
[]
[null,"Nombre de la Empresa o Razón Social",null,null,null,null,null,null,null,null,null,null,null,null,null,null,null,null,null,null,null,null,null,null,null,null,null,null,null,null,null,null,null,null,null,null,null,null,null,null,null,null,null,null,null,null,null,null,"NIT - DV",null,null,null,null,null,null,null,null,null,null,"-"]
[]
[null,"Primer Nombre",null,null,null,null,null,null,null,null,null,null,null,null,"Otros Nombres",null,null,null,null,null,null,null,null,null,null,null,null,null,"Primer Apellido",null,null,null,null,null,null,null,null,null,null,null,null,null,null,null,null,"Segundo Apellido"]
[]
[null,"Tipo de Documento",null,null,null,null,null,null,null,null,null,null,null,null,"Número de identificación",null,null,null,null,null,null,null,null,null,null,null,null,null,"País de Expedición de Identificación"]
[]
[null,null,null,null,null,null,null,null,null,null,null,"Número de identificación Tributaria (NIT)",null,null,null,null,null,null,null,null,null,null,null,null,null,null,null,null,"País Expedición (NIT)"]
[]
[null,null,null,null,null,null,null,null,null,null,null,null,"Fecha de Nacimiento (PN)",null,null,null,null,null,null,null,null,null,null,null,null,null,null,null,"País de Nacimiento ",null,null,null,null,null,null,null,null,null,null,null,null,null,null,null,null,"País de Nacionalidad"]
[]
[null,"Dirección Residencia",null,null,null,null,null,null,null,null,null,null,null,null,null,null,null,null,null,"Departamento",null,null,null,null,null,null,null,null,null,null,null,null,null,null,"Municipio",null,null,null,null,null,null,null,null,null,"País de Residencia"]
[]
[null,null,null,null,null,null,null,null,null,null,null,null,null,null,null,null,null,null,null,"Código Postal",null,null,null,null,null,null,null,null,null,null,"Correo electrónico"]
[]
[null,"Beneficiario final de la estructura sin personería jurídica"]
[]
[null,"Fiduciante / Fideicomitente / Constituyente o posición similar o equivalente",null,null,null,null,null,null,null,null,null,null,null,null,null,null,"Comité financiero o posición similar o equivalente",null,null,null,null,null,null,null,null,null,null,null,null,"Fideicomisario / Beneficiario",null,null,null,null,null,null,null,null,null,null,"Ejerce control final y/o efectivo o tiene derecho a gozar y/o disponer de los activos, beneficios, resultados o utilidades"]
[]
[null,null,"Beneficiario Condicionado",null,null,null,null,null,null,null,{"$f":"+IF(AC86=\"\",\"N\",\"S\")","v":"N"},null,null,null,null,"Condiciones que se deben cumplir para tener la calidad de beneficiario final - (Beneficiario Condicionado)"]
[]
[null,"Participación en el capital de la persona jurídica (%)",null,null,null,null,null,null,null,null,null,null,null,null,null,"Fecha desde la cual tiene la calidad de ben. final o existe la condición",null,null,null,null,null,null,null,null,null,null,null,null,null,null,null,null,null,"Fecha desde la cual deja de tener la calidad de ben. final o de existir la condición"]
[]
[null,{"$f":"+B64+1","v":4},"Tipo Novedad"]
[null,{"$f":"+\"Beneficiario \"&B90&\".\"","v":"Beneficiario 4."}]
[null,"Datos de los Beneficiarios Finales"]
[]
[null,"Nombre de la Empresa o Razón Social",null,null,null,null,null,null,null,null,null,null,null,null,null,null,null,null,null,null,null,null,null,null,null,null,null,null,null,null,null,null,null,null,null,null,null,null,null,null,null,null,null,null,null,null,null,null,"NIT - DV",null,null,null,null,null,null,null,null,null,null,"-"]
[]
[null,"Primer Nombre",null,null,null,null,null,null,null,null,null,null,null,null,"Otros Nombres",null,null,null,null,null,null,null,null,null,null,null,null,null,"Primer Apellido",null,null,null,null,null,null,null,null,null,null,null,null,null,null,null,null,"Segundo Apellido"]
[]
[null,"Tipo de Documento",null,null,null,null,null,null,null,null,null,null,null,null,"Número de identificación",null,null,null,null,null,null,null,null,null,null,null,null,null,"País de Expedición de Identificación"]
[]
[null,null,null,null,null,null,null,null,null,null,null,"Número de identificación Tributaria (NIT)",null,null,null,null,null,null,null,null,null,null,null,null,null,null,null,null,"País Expedición (NIT)"]
[]
[null,null,null,null,null,null,null,null,null,null,null,null,"Fecha de Nacimiento (PN)",null,null,null,null,null,null,null,null,null,null,null,null,null,null,null,"País de Nacimiento ",null,null,null,null,null,null,null,null,null,null,null,null,null,null,null,null,"País de Nacionalidad"]
[]
[null,"Dirección Residencia",null,null,null,null,null,null,null,null,null,null,null,null,null,null,null,null,null,"Departamento",null,null,null,null,null,null,null,null,null,null,null,null,null,null,"Municipio",null,null,null,null,null,null,null,null,null,"País de Residencia"]
[]
[null,null,null,null,null,null,null,null,null,null,null,null,null,null,null,null,null,null,null,"Código Postal",null,null,null,null,null,null,null,null,null,null,"Correo electrónico"]
[]
[null,"Beneficiario final de la estructura sin personería jurídica"]
[]
[null,"Fiduciante / Fideicomitente / Constituyente o posición similar o equivalente",null,null,null,null,null,null,null,null,null,null,null,null,null,null,"Comité financiero o posición similar o equivalente",null,null,null,null,null,null,null,null,null,null,null,null,"Fideicomisario / Beneficiario",null,null,null,null,null,null,null,null,null,null,"Ejerce control final y/o efectivo o tiene derecho a gozar y/o disponer de los activos, beneficios, resultados o utilidades"]
[]
[null,null,"Beneficiario Condicionado",null,null,null,null,null,null,null,{"$f":"+IF(AC112=\"\",\"N\",\"S\")","v":"N"},null,null,null,null,"Condiciones que se deben cumplir para tener la calidad de beneficiario final - (Beneficiario Condicionado)"]
[]
[null,"Participación en el capital de la persona jurídica (%)",null,null,null,null,null,null,null,null,null,null,null,null,null,"Fecha desde la cual tiene la calidad de ben. final o existe la condición",null,null,null,null,null,null,null,null,null,null,null,null,null,null,null,null,null,"Fecha desde la cual deja de tener la calidad de ben. final o de existir la condición"]
[]
[null,{"$f":"+B90+1","v":5},"Tipo Novedad"]
[null,{"$f":"+\"Beneficiario \"&B116&\".\"","v":"Beneficiario 5."}]
[null,"Datos de los Beneficiarios Finales"]
[]
[null,"Nombre de la Empresa o Razón Social",null,null,null,null,null,null,null,null,null,null,null,null,null,null,null,null,null,null,null,null,null,null,null,null,null,null,null,null,null,null,null,null,null,null,null,null,null,null,null,null,null,null,null,null,null,null,"NIT - DV",null,null,null,null,null,null,null,null,null,null,"-"]
[]
[null,"Primer Nombre",null,null,null,null,null,null,null,null,null,null,null,null,"Otros Nombres",null,null,null,null,null,null,null,null,null,null,null,null,null,"Primer Apellido",null,null,null,null,null,null,null,null,null,null,null,null,null,null,null,null,"Segundo Apellido"]
[]
[null,"Tipo de Documento",null,null,null,null,null,null,null,null,null,null,null,null,"Número de identificación",null,null,null,null,null,null,null,null,null,null,null,null,null,"País de Expedición de Identificación"]
[]
[null,null,null,null,null,null,null,null,null,null,null,"Número de identificación Tributaria (NIT)",null,null,null,null,null,null,null,null,null,null,null,null,null,null,null,null,"País Expedición (NIT)"]
[]
[null,null,null,null,null,null,null,null,null,null,null,null,"Fecha de Nacimiento (PN)",null,null,null,null,null,null,null,null,null,null,null,null,null,null,null,"País de Nacimiento ",null,null,null,null,null,null,null,null,null,null,null,null,null,null,null,null,"País de Nacionalidad"]
[]
[null,"Dirección Residencia",null,null,null,null,null,null,null,null,null,null,null,null,null,null,null,null,null,"Departamento",null,null,null,null,null,null,null,null,null,null,null,null,null,null,"Municipio",null,null,null,null,null,null,null,null,null,"País de Residencia"]
[]
[null,null,null,null,null,null,null,null,null,null,null,null,null,null,null,null,null,null,null,"Código Postal",null,null,null,null,null,null,null,null,null,null,"Correo electrónico"]
[]
[null,"Beneficiario final de la estructura sin personería jurídica"]
[]
[null,"Fiduciante / Fideicomitente / Constituyente o posición similar o equivalente",null,null,null,null,null,null,null,null,null,null,null,null,null,null,"Comité financiero o posición similar o equivalente",null,null,null,null,null,null,null,null,null,null,null,null,"Fideicomisario / Beneficiario",null,null,null,null,null,null,null,null,null,null,"Ejerce control final y/o efectivo o tiene derecho a gozar y/o disponer de los activos, beneficios, resultados o utilidades"]
[]
[null,null,"Beneficiario Condicionado",null,null,null,null,null,null,null,{"$f":"+IF(AC138=\"\",\"N\",\"S\")","v":"N"},null,null,null,null,"Condiciones que se deben cumplir para tener la calidad de beneficiario final - (Beneficiario Condicionado)"]
[]
[null,"Participación en el capital de la persona jurídica (%)",null,null,null,null,null,null,null,null,null,null,null,null,null,"Fecha desde la cual tiene la calidad de ben. final o existe la condición",null,null,null,null,null,null,null,null,null,null,null,null,null,null,null,null,null,"Fecha desde la cual deja de tener la calidad de ben. final o de existir la condición"]
[]
[null,{"$f":"+B116+1","v":6},"Tipo Novedad"]
[null,{"$f":"+\"Beneficiario \"&B142&\".\"","v":"Beneficiario 6."}]
[null,"Datos de los Beneficiarios Finales"]
[]
[null,"Nombre de la Empresa o Razón Social",null,null,null,null,null,null,null,null,null,null,null,null,null,null,null,null,null,null,null,null,null,null,null,null,null,null,null,null,null,null,null,null,null,null,null,null,null,null,null,null,null,null,null,null,null,null,"NIT - DV",null,null,null,null,null,null,null,null,null,null,"-"]
[]
[null,"Primer Nombre",null,null,null,null,null,null,null,null,null,null,null,null,"Otros Nombres",null,null,null,null,null,null,null,null,null,null,null,null,null,"Primer Apellido",null,null,null,null,null,null,null,null,null,null,null,null,null,null,null,null,"Segundo Apellido"]
[]
[null,"Tipo de Documento",null,null,null,null,null,null,null,null,null,null,null,null,"Número de identificación",null,null,null,null,null,null,null,null,null,null,null,null,null,"País de Expedición de Identificación"]
[]
[null,null,null,null,null,null,null,null,null,null,null,"Número de identificación Tributaria (NIT)",null,null,null,null,null,null,null,null,null,null,null,null,null,null,null,null,"País Expedición (NIT)"]
[]
[null,null,null,null,null,null,null,null,null,null,null,null,"Fecha de Nacimiento (PN)",null,null,null,null,null,null,null,null,null,null,null,null,null,null,null,"País de Nacimiento ",null,null,null,null,null,null,null,null,null,null,null,null,null,null,null,null,"País de Nacionalidad"]
[]
[null,"Dirección Residencia",null,null,null,null,null,null,null,null,null,null,null,null,null,null,null,null,null,"Departamento",null,null,null,null,null,null,null,null,null,null,null,null,null,null,"Municipio",null,null,null,null,null,null,null,null,null,"País de Residencia"]
[]
[null,null,null,null,null,null,null,null,null,null,null,null,null,null,null,null,null,null,null,"Código Postal",null,null,null,null,null,null,null,null,null,null,"Correo electrónico"]
[]
[null,"Beneficiario final de la estructura sin personería jurídica"]
[]
[null,"Fiduciante / Fideicomitente / Constituyente o posición similar o equivalente",null,null,null,null,null,null,null,null,null,null,null,null,null,null,"Comité financiero o posición similar o equivalente",null,null,null,null,null,null,null,null,null,null,null,null,"Fideicomisario / Beneficiario",null,null,null,null,null,null,null,null,null,null,"Ejerce control final y/o efectivo o tiene derecho a gozar y/o disponer de los activos, beneficios, resultados o utilidades"]
[]
[null,null,"Beneficiario Condicionado",null,null,null,null,null,null,null,{"$f":"+IF(AC164=\"\",\"N\",\"S\")","v":"N"},null,null,null,null,"Condiciones que se deben cumplir para tener la calidad de beneficiario final - (Beneficiario Condicionado)"]
[]
[null,"Participación en el capital de la persona jurídica (%)",null,null,null,null,null,null,null,null,null,null,null,null,null,"Fecha desde la cual tiene la calidad de ben. final o existe la condición",null,null,null,null,null,null,null,null,null,null,null,null,null,null,null,null,null,"Fecha desde la cual deja de tener la calidad de ben. final o de existir la condición"]
[]
[null,{"$f":"+B142+1","v":7},"Tipo Novedad"]
[null,{"$f":"+\"Beneficiario \"&B168&\".\"","v":"Beneficiario 7."}]
[null,"Datos de los Beneficiarios Finales"]
[]
[null,"Nombre de la Empresa o Razón Social",null,null,null,null,null,null,null,null,null,null,null,null,null,null,null,null,null,null,null,null,null,null,null,null,null,null,null,null,null,null,null,null,null,null,null,null,null,null,null,null,null,null,null,null,null,null,"NIT - DV",null,null,null,null,null,null,null,null,null,null,"-"]
[]
[null,"Primer Nombre",null,null,null,null,null,null,null,null,null,null,null,null,"Otros Nombres",null,null,null,null,null,null,null,null,null,null,null,null,null,"Primer Apellido",null,null,null,null,null,null,null,null,null,null,null,null,null,null,null,null,"Segundo Apellido"]
[]
[null,"Tipo de Documento",null,null,null,null,null,null,null,null,null,null,null,null,"Número de identificación",null,null,null,null,null,null,null,null,null,null,null,null,null,"País de Expedición de Identificación"]
[]
[null,null,null,null,null,null,null,null,null,null,null,"Número de identificación Tributaria (NIT)",null,null,null,null,null,null,null,null,null,null,null,null,null,null,null,null,"País Expedición (NIT)"]
[]
[null,null,null,null,null,null,null,null,null,null,null,null,"Fecha de Nacimiento (PN)",null,null,null,null,null,null,null,null,null,null,null,null,null,null,null,"País de Nacimiento ",null,null,null,null,null,null,null,null,null,null,null,null,null,null,null,null,"País de Nacionalidad"]
[]
[null,"Dirección Residencia",null,null,null,null,null,null,null,null,null,null,null,null,null,null,null,null,null,"Departamento",null,null,null,null,null,null,null,null,null,null,null,null,null,null,"Municipio",null,null,null,null,null,null,null,null,null,"País de Residencia"]
[]
[null,null,null,null,null,null,null,null,null,null,null,null,null,null,null,null,null,null,null,"Código Postal",null,null,null,null,null,null,null,null,null,null,"Correo electrónico"]
[]
[null,"Beneficiario final de la estructura sin personería jurídica"]
[]
[null,"Fiduciante / Fideicomitente / Constituyente o posición similar o equivalente",null,null,null,null,null,null,null,null,null,null,null,null,null,null,"Comité financiero o posición similar o equivalente",null,null,null,null,null,null,null,null,null,null,null,null,"Fideicomisario / Beneficiario",null,null,null,null,null,null,null,null,null,null,"Ejerce control final y/o efectivo o tiene derecho a gozar y/o disponer de los activos, beneficios, resultados o utilidades"]
[]
[null,null,"Beneficiario Condicionado",null,null,null,null,null,null,null,{"$f":"+IF(AC190=\"\",\"N\",\"S\")","v":"N"},null,null,null,null,"Condiciones que se deben cumplir para tener la calidad de beneficiario final - (Beneficiario Condicionado)"]
[]
[null,"Participación en el capital de la persona jurídica (%)",null,null,null,null,null,null,null,null,null,null,null,null,null,"Fecha desde la cual tiene la calidad de ben. final o existe la condición",null,null,null,null,null,null,null,null,null,null,null,null,null,null,null,null,null,"Fecha desde la cual deja de tener la calidad de ben. final o de existir la condición"]
[]
[null,{"$f":"+B168+1","v":8},"Tipo Novedad"]
[null,{"$f":"+\"Beneficiario \"&B194&\".\"","v":"Beneficiario 8."}]
[null,"Datos de los Beneficiarios Finales"]
[]
[null,"Nombre de la Empresa o Razón Social",null,null,null,null,null,null,null,null,null,null,null,null,null,null,null,null,null,null,null,null,null,null,null,null,null,null,null,null,null,null,null,null,null,null,null,null,null,null,null,null,null,null,null,null,null,null,"NIT - DV",null,null,null,null,null,null,null,null,null,null,"-"]
[]
[null,"Primer Nombre",null,null,null,null,null,null,null,null,null,null,null,null,"Otros Nombres",null,null,null,null,null,null,null,null,null,null,null,null,null,"Primer Apellido",null,null,null,null,null,null,null,null,null,null,null,null,null,null,null,null,"Segundo Apellido"]
[]
[null,"Tipo de Documento",null,null,null,null,null,null,null,null,null,null,null,null,"Número de identificación",null,null,null,null,null,null,null,null,null,null,null,null,null,"País de Expedición de Identificación"]
[]
[null,null,null,null,null,null,null,null,null,null,null,"Número de identificación Tributaria (NIT)",null,null,null,null,null,null,null,null,null,null,null,null,null,null,null,null,"País Expedición (NIT)"]
[]
[null,null,null,null,null,null,null,null,null,null,null,null,"Fecha de Nacimiento (PN)",null,null,null,null,null,null,null,null,null,null,null,null,null,null,null,"País de Nacimiento ",null,null,null,null,null,null,null,null,null,null,null,null,null,null,null,null,"País de Nacionalidad"]
[]
[null,"Dirección Residencia",null,null,null,null,null,null,null,null,null,null,null,null,null,null,null,null,null,"Departamento",null,null,null,null,null,null,null,null,null,null,null,null,null,null,"Municipio",null,null,null,null,null,null,null,null,null,"País de Residencia"]
[]
[null,null,null,null,null,null,null,null,null,null,null,null,null,null,null,null,null,null,null,"Código Postal",null,null,null,null,null,null,null,null,null,null,"Correo electrónico"]
[]
[null,"Beneficiario final de la estructura sin personería jurídica"]
[]
[null,"Fiduciante / Fideicomitente / Constituyente o posición similar o equivalente",null,null,null,null,null,null,null,null,null,null,null,null,null,null,"Comité financiero o posición similar o equivalente",null,null,null,null,null,null,null,null,null,null,null,null,"Fideicomisario / Beneficiario",null,null,null,null,null,null,null,null,null,null,"Ejerce control final y/o efectivo o tiene derecho a gozar y/o disponer de los activos, beneficios, resultados o utilidades"]
[]
[null,null,"Beneficiario Condicionado",null,null,null,null,null,null,null,{"$f":"+IF(AC216=\"\",\"N\",\"S\")","v":"N"},null,null,null,null,"Condiciones que se deben cumplir para tener la calidad de beneficiario final - (Beneficiario Condicionado)"]
[]
[null,"Participación en el capital de la persona jurídica (%)",null,null,null,null,null,null,null,null,null,null,null,null,null,"Fecha desde la cual tiene la calidad de ben. final o existe la condición",null,null,null,null,null,null,null,null,null,null,null,null,null,null,null,null,null,"Fecha desde la cual deja de tener la calidad de ben. final o de existir la condición"]
[]
[null,{"$f":"+B194+1","v":9},"Tipo Novedad"]
[null,{"$f":"+\"Beneficiario \"&B220&\".\"","v":"Beneficiario 9."}]
[null,"Datos de los Beneficiarios Finales"]
[]
[null,"Nombre de la Empresa o Razón Social",null,null,null,null,null,null,null,null,null,null,null,null,null,null,null,null,null,null,null,null,null,null,null,null,null,null,null,null,null,null,null,null,null,null,null,null,null,null,null,null,null,null,null,null,null,null,"NIT - DV",null,null,null,null,null,null,null,null,null,null,"-"]
[]
[null,"Primer Nombre",null,null,null,null,null,null,null,null,null,null,null,null,"Otros Nombres",null,null,null,null,null,null,null,null,null,null,null,null,null,"Primer Apellido",null,null,null,null,null,null,null,null,null,null,null,null,null,null,null,null,"Segundo Apellido"]
[]
[null,"Tipo de Documento",null,null,null,null,null,null,null,null,null,null,null,null,"Número de identificación",null,null,null,null,null,null,null,null,null,null,null,null,null,"País de Expedición de Identificación"]
[]
[null,null,null,null,null,null,null,null,null,null,null,"Número de identificación Tributaria (NIT)",null,null,null,null,null,null,null,null,null,null,null,null,null,null,null,null,"País Expedición (NIT)"]
[]
[null,null,null,null,null,null,null,null,null,null,null,null,"Fecha de Nacimiento (PN)",null,null,null,null,null,null,null,null,null,null,null,null,null,null,null,"País de Nacimiento ",null,null,null,null,null,null,null,null,null,null,null,null,null,null,null,null,"País de Nacionalidad"]
[]
[null,"Dirección Residencia",null,null,null,null,null,null,null,null,null,null,null,null,null,null,null,null,null,"Departamento",null,null,null,null,null,null,null,null,null,null,null,null,null,null,"Municipio",null,null,null,null,null,null,null,null,null,"País de Residencia"]
[]
[null,null,null,null,null,null,null,null,null,null,null,null,null,null,null,null,null,null,null,"Código Postal",null,null,null,null,null,null,null,null,null,null,"Correo electrónico"]
[]
[null,"Beneficiario final de la estructura sin personería jurídica"]
[]
[null,"Fiduciante / Fideicomitente / Constituyente o posición similar o equivalente",null,null,null,null,null,null,null,null,null,null,null,null,null,null,"Comité financiero o posición similar o equivalente",null,null,null,null,null,null,null,null,null,null,null,null,"Fideicomisario / Beneficiario",null,null,null,null,null,null,null,null,null,null,"Ejerce control final y/o efectivo o tiene derecho a gozar y/o disponer de los activos, beneficios, resultados o utilidades"]
[]
[null,null,"Beneficiario Condicionado",null,null,null,null,null,null,null,{"$f":"+IF(AC242=\"\",\"N\",\"S\")","v":"N"},null,null,null,null,"Condiciones que se deben cumplir para tener la calidad de beneficiario final - (Beneficiario Condicionado)"]
[]
[null,"Participación en el capital de la persona jurídica (%)",null,null,null,null,null,null,null,null,null,null,null,null,null,"Fecha desde la cual tiene la calidad de ben. final o existe la condición",null,null,null,null,null,null,null,null,null,null,null,null,null,null,null,null,null,"Fecha desde la cual deja de tener la calidad de ben. final o de existir la condición"]
[]
[null,{"$f":"+B220+1","v":10},"Tipo Novedad"]
[null,{"$f":"+\"Beneficiario \"&B246&\".\"","v":"Beneficiario 10."}]
[null,"Datos de los Beneficiarios Finales"]
[]
[null,"Nombre de la Empresa o Razón Social",null,null,null,null,null,null,null,null,null,null,null,null,null,null,null,null,null,null,null,null,null,null,null,null,null,null,null,null,null,null,null,null,null,null,null,null,null,null,null,null,null,null,null,null,null,null,"NIT - DV",null,null,null,null,null,null,null,null,null,null,"-"]
[]
[null,"Primer Nombre",null,null,null,null,null,null,null,null,null,null,null,null,"Otros Nombres",null,null,null,null,null,null,null,null,null,null,null,null,null,"Primer Apellido",null,null,null,null,null,null,null,null,null,null,null,null,null,null,null,null,"Segundo Apellido"]
[]
[null,"Tipo de Documento",null,null,null,null,null,null,null,null,null,null,null,null,"Número de identificación",null,null,null,null,null,null,null,null,null,null,null,null,null,"País de Expedición de Identificación"]
[]
[null,null,null,null,null,null,null,null,null,null,null,"Número de identificación Tributaria (NIT)",null,null,null,null,null,null,null,null,null,null,null,null,null,null,null,null,"País Expedición (NIT)"]
[]
[null,null,null,null,null,null,null,null,null,null,null,null,"Fecha de Nacimiento (PN)",null,null,null,null,null,null,null,null,null,null,null,null,null,null,null,"País de Nacimiento ",null,null,null,null,null,null,null,null,null,null,null,null,null,null,null,null,"País de Nacionalidad"]
[]
[null,"Dirección Residencia",null,null,null,null,null,null,null,null,null,null,null,null,null,null,null,null,null,"Departamento",null,null,null,null,null,null,null,null,null,null,null,null,null,null,"Municipio",null,null,null,null,null,null,null,null,null,"País de Residencia"]
[]
[null,null,null,null,null,null,null,null,null,null,null,null,null,null,null,null,null,null,null,"Código Postal",null,null,null,null,null,null,null,null,null,null,"Correo electrónico"]
[]
[null,"Beneficiario final de la estructura sin personería jurídica"]
[]
[null,"Fiduciante / Fideicomitente / Constituyente o posición similar o equivalente",null,null,null,null,null,null,null,null,null,null,null,null,null,null,"Comité financiero o posición similar o equivalente",null,null,null,null,null,null,null,null,null,null,null,null,"Fideicomisario / Beneficiario",null,null,null,null,null,null,null,null,null,null,"Ejerce control final y/o efectivo o tiene derecho a gozar y/o disponer de los activos, beneficios, resultados o utilidades"]
[]
[null,null,"Beneficiario Condicionado",null,null,null,null,null,null,null,{"$f":"+IF(AC268=\"\",\"N\",\"S\")","v":"N"},null,null,null,null,"Condiciones que se deben cumplir para tener la calidad de beneficiario final - (Beneficiario Condicionado)"]
[]
[null,"Participación en el capital de la persona jurídica (%)",null,null,null,null,null,null,null,null,null,null,null,null,null,"Fecha desde la cual tiene la calidad de ben. final o existe la condición",null,null,null,null,null,null,null,null,null,null,null,null,null,null,null,null,null,"Fecha desde la cual deja de tener la calidad de ben. final o de existir la condición"]
[]
[null,{"$f":"+B246+1","v":11},"Tipo Novedad"]
[null,{"$f":"+\"Beneficiario \"&B272&\".\"","v":"Beneficiario 11."}]
[null,"Datos de los Beneficiarios Finales"]
[]
[null,"Nombre de la Empresa o Razón Social",null,null,null,null,null,null,null,null,null,null,null,null,null,null,null,null,null,null,null,null,null,null,null,null,null,null,null,null,null,null,null,null,null,null,null,null,null,null,null,null,null,null,null,null,null,null,"NIT - DV",null,null,null,null,null,null,null,null,null,null,"-"]
[]
[null,"Primer Nombre",null,null,null,null,null,null,null,null,null,null,null,null,"Otros Nombres",null,null,null,null,null,null,null,null,null,null,null,null,null,"Primer Apellido",null,null,null,null,null,null,null,null,null,null,null,null,null,null,null,null,"Segundo Apellido"]
[]
[null,"Tipo de Documento",null,null,null,null,null,null,null,null,null,null,null,null,"Número de identificación",null,null,null,null,null,null,null,null,null,null,null,null,null,"País de Expedición de Identificación"]
[]
[null,null,null,null,null,null,null,null,null,null,null,"Número de identificación Tributaria (NIT)",null,null,null,null,null,null,null,null,null,null,null,null,null,null,null,null,"País Expedición (NIT)"]
[]
[null,null,null,null,null,null,null,null,null,null,null,null,"Fecha de Nacimiento (PN)",null,null,null,null,null,null,null,null,null,null,null,null,null,null,null,"País de Nacimiento ",null,null,null,null,null,null,null,null,null,null,null,null,null,null,null,null,"País de Nacionalidad"]
[]
[null,"Dirección Residencia",null,null,null,null,null,null,null,null,null,null,null,null,null,null,null,null,null,"Departamento",null,null,null,null,null,null,null,null,null,null,null,null,null,null,"Municipio",null,null,null,null,null,null,null,null,null,"País de Residencia"]
[]
[null,null,null,null,null,null,null,null,null,null,null,null,null,null,null,null,null,null,null,"Código Postal",null,null,null,null,null,null,null,null,null,null,"Correo electrónico"]
[]
[null,"Beneficiario final de la estructura sin personería jurídica"]
[]
[null,"Fiduciante / Fideicomitente / Constituyente o posición similar o equivalente",null,null,null,null,null,null,null,null,null,null,null,null,null,null,"Comité financiero o posición similar o equivalente",null,null,null,null,null,null,null,null,null,null,null,null,"Fideicomisario / Beneficiario",null,null,null,null,null,null,null,null,null,null,"Ejerce control final y/o efectivo o tiene derecho a gozar y/o disponer de los activos, beneficios, resultados o utilidades"]
[]
[null,null,"Beneficiario Condicionado",null,null,null,null,null,null,null,{"$f":"+IF(AC294=\"\",\"N\",\"S\")","v":"N"},null,null,null,null,"Condiciones que se deben cumplir para tener la calidad de beneficiario final - (Beneficiario Condicionado)"]
[]
[null,"Participación en el capital de la persona jurídica (%)",null,null,null,null,null,null,null,null,null,null,null,null,null,"Fecha desde la cual tiene la calidad de ben. final o existe la condición",null,null,null,null,null,null,null,null,null,null,null,null,null,null,null,null,null,"Fecha desde la cual deja de tener la calidad de ben. final o de existir la condición"]
[]
[null,{"$f":"+B272+1","v":12},"Tipo Novedad"]
[null,{"$f":"+\"Beneficiario \"&B298&\".\"","v":"Beneficiario 12."}]
[null,"Datos de los Beneficiarios Finales"]
[]
[null,"Nombre de la Empresa o Razón Social",null,null,null,null,null,null,null,null,null,null,null,null,null,null,null,null,null,null,null,null,null,null,null,null,null,null,null,null,null,null,null,null,null,null,null,null,null,null,null,null,null,null,null,null,null,null,"NIT - DV",null,null,null,null,null,null,null,null,null,null,"-"]
[]
[null,"Primer Nombre",null,null,null,null,null,null,null,null,null,null,null,null,"Otros Nombres",null,null,null,null,null,null,null,null,null,null,null,null,null,"Primer Apellido",null,null,null,null,null,null,null,null,null,null,null,null,null,null,null,null,"Segundo Apellido"]
[]
[null,"Tipo de Documento",null,null,null,null,null,null,null,null,null,null,null,null,"Número de identificación",null,null,null,null,null,null,null,null,null,null,null,null,null,"País de Expedición de Identificación"]
[]
[null,null,null,null,null,null,null,null,null,null,null,"Número de identificación Tributaria (NIT)",null,null,null,null,null,null,null,null,null,null,null,null,null,null,null,null,"País Expedición (NIT)"]
[]
[null,null,null,null,null,null,null,null,null,null,null,null,"Fecha de Nacimiento (PN)",null,null,null,null,null,null,null,null,null,null,null,null,null,null,null,"País de Nacimiento ",null,null,null,null,null,null,null,null,null,null,null,null,null,null,null,null,"País de Nacionalidad"]
[]
[null,"Dirección Residencia",null,null,null,null,null,null,null,null,null,null,null,null,null,null,null,null,null,"Departamento",null,null,null,null,null,null,null,null,null,null,null,null,null,null,"Municipio",null,null,null,null,null,null,null,null,null,"País de Residencia"]
[]
[null,null,null,null,null,null,null,null,null,null,null,null,null,null,null,null,null,null,null,"Código Postal",null,null,null,null,null,null,null,null,null,null,"Correo electrónico"]
[]
[null,"Beneficiario final de la estructura sin personería jurídica"]
[]
[null,"Fiduciante / Fideicomitente / Constituyente o posición similar o equivalente",null,null,null,null,null,null,null,null,null,null,null,null,null,null,"Comité financiero o posición similar o equivalente",null,null,null,null,null,null,null,null,null,null,null,null,"Fideicomisario / Beneficiario",null,null,null,null,null,null,null,null,null,null,"Ejerce control final y/o efectivo o tiene derecho a gozar y/o disponer de los activos, beneficios, resultados o utilidades"]
[]
[null,null,"Beneficiario Condicionado",null,null,null,null,null,null,null,{"$f":"+IF(AC320=\"\",\"N\",\"S\")","v":"N"},null,null,null,null,"Condiciones que se deben cumplir para tener la calidad de beneficiario final - (Beneficiario Condicionado)"]
[]
[null,"Participación en el capital de la persona jurídica (%)",null,null,null,null,null,null,null,null,null,null,null,null,null,"Fecha desde la cual tiene la calidad de ben. final o existe la condición",null,null,null,null,null,null,null,null,null,null,null,null,null,null,null,null,null,"Fecha desde la cual deja de tener la calidad de ben. final o de existir la condición"]
[]
[null,{"$f":"+B298+1","v":13},"Tipo Novedad"]
[null,{"$f":"+\"Beneficiario \"&B324&\".\"","v":"Beneficiario 13."}]
[null,"Datos de los Beneficiarios Finales"]
[]
[null,"Nombre de la Empresa o Razón Social",null,null,null,null,null,null,null,null,null,null,null,null,null,null,null,null,null,null,null,null,null,null,null,null,null,null,null,null,null,null,null,null,null,null,null,null,null,null,null,null,null,null,null,null,null,null,"NIT - DV",null,null,null,null,null,null,null,null,null,null,"-"]
[]
[null,"Primer Nombre",null,null,null,null,null,null,null,null,null,null,null,null,"Otros Nombres",null,null,null,null,null,null,null,null,null,null,null,null,null,"Primer Apellido",null,null,null,null,null,null,null,null,null,null,null,null,null,null,null,null,"Segundo Apellido"]
[]
[null,"Tipo de Documento",null,null,null,null,null,null,null,null,null,null,null,null,"Número de identificación",null,null,null,null,null,null,null,null,null,null,null,null,null,"País de Expedición de Identificación"]
[]
[null,null,null,null,null,null,null,null,null,null,null,"Número de identificación Tributaria (NIT)",null,null,null,null,null,null,null,null,null,null,null,null,null,null,null,null,"País Expedición (NIT)"]
[]
[null,null,null,null,null,null,null,null,null,null,null,null,"Fecha de Nacimiento (PN)",null,null,null,null,null,null,null,null,null,null,null,null,null,null,null,"País de Nacimiento ",null,null,null,null,null,null,null,null,null,null,null,null,null,null,null,null,"País de Nacionalidad"]
[]
[null,"Dirección Residencia",null,null,null,null,null,null,null,null,null,null,null,null,null,null,null,null,null,"Departamento",null,null,null,null,null,null,null,null,null,null,null,null,null,null,"Municipio",null,null,null,null,null,null,null,null,null,"País de Residencia"]
[]
[null,null,null,null,null,null,null,null,null,null,null,null,null,null,null,null,null,null,null,"Código Postal",null,null,null,null,null,null,null,null,null,null,"Correo electrónico"]
[]
[null,"Beneficiario final de la estructura sin personería jurídica"]
[]
[null,"Fiduciante / Fideicomitente / Constituyente o posición similar o equivalente",null,null,null,null,null,null,null,null,null,null,null,null,null,null,"Comité financiero o posición similar o equivalente",null,null,null,null,null,null,null,null,null,null,null,null,"Fideicomisario / Beneficiario",null,null,null,null,null,null,null,null,null,null,"Ejerce control final y/o efectivo o tiene derecho a gozar y/o disponer de los activos, beneficios, resultados o utilidades"]
[]
[null,null,"Beneficiario Condicionado",null,null,null,null,null,null,null,{"$f":"+IF(AC346=\"\",\"N\",\"S\")","v":"N"},null,null,null,null,"Condiciones que se deben cumplir para tener la calidad de beneficiario final - (Beneficiario Condicionado)"]
[]
[null,"Participación en el capital de la persona jurídica (%)",null,null,null,null,null,null,null,null,null,null,null,null,null,"Fecha desde la cual tiene la calidad de ben. final o existe la condición",null,null,null,null,null,null,null,null,null,null,null,null,null,null,null,null,null,"Fecha desde la cual deja de tener la calidad de ben. final o de existir la condición"]
[]
[null,{"$f":"+B324+1","v":14},"Tipo Novedad"]
[null,{"$f":"+\"Beneficiario \"&B350&\".\"","v":"Beneficiario 14."}]
[null,"Datos de los Beneficiarios Finales"]
[]
[null,"Nombre de la Empresa o Razón Social",null,null,null,null,null,null,null,null,null,null,null,null,null,null,null,null,null,null,null,null,null,null,null,null,null,null,null,null,null,null,null,null,null,null,null,null,null,null,null,null,null,null,null,null,null,null,"NIT - DV",null,null,null,null,null,null,null,null,null,null,"-"]
[]
[null,"Primer Nombre",null,null,null,null,null,null,null,null,null,null,null,null,"Otros Nombres",null,null,null,null,null,null,null,null,null,null,null,null,null,"Primer Apellido",null,null,null,null,null,null,null,null,null,null,null,null,null,null,null,null,"Segundo Apellido"]
[]
[null,"Tipo de Documento",null,null,null,null,null,null,null,null,null,null,null,null,"Número de identificación",null,null,null,null,null,null,null,null,null,null,null,null,null,"País de Expedición de Identificación"]
[]
[null,null,null,null,null,null,null,null,null,null,null,"Número de identificación Tributaria (NIT)",null,null,null,null,null,null,null,null,null,null,null,null,null,null,null,null,"País Expedición (NIT)"]
[]
[null,null,null,null,null,null,null,null,null,null,null,null,"Fecha de Nacimiento (PN)",null,null,null,null,null,null,null,null,null,null,null,null,null,null,null,"País de Nacimiento ",null,null,null,null,null,null,null,null,null,null,null,null,null,null,null,null,"País de Nacionalidad"]
[]
[null,"Dirección Residencia",null,null,null,null,null,null,null,null,null,null,null,null,null,null,null,null,null,"Departamento",null,null,null,null,null,null,null,null,null,null,null,null,null,null,"Municipio",null,null,null,null,null,null,null,null,null,"País de Residencia"]
[]
[null,null,null,null,null,null,null,null,null,null,null,null,null,null,null,null,null,null,null,"Código Postal",null,null,null,null,null,null,null,null,null,null,"Correo electrónico"]
[]
[null,"Beneficiario final de la estructura sin personería jurídica"]
[]
[null,"Fiduciante / Fideicomitente / Constituyente o posición similar o equivalente",null,null,null,null,null,null,null,null,null,null,null,null,null,null,"Comité financiero o posición similar o equivalente",null,null,null,null,null,null,null,null,null,null,null,null,"Fideicomisario / Beneficiario",null,null,null,null,null,null,null,null,null,null,"Ejerce control final y/o efectivo o tiene derecho a gozar y/o disponer de los activos, beneficios, resultados o utilidades"]
[]
[null,null,"Beneficiario Condicionado",null,null,null,null,null,null,null,{"$f":"+IF(AC372=\"\",\"N\",\"S\")","v":"N"},null,null,null,null,"Condiciones que se deben cumplir para tener la calidad de beneficiario final - (Beneficiario Condicionado)"]
[]
[null,"Participación en el capital de la persona jurídica (%)",null,null,null,null,null,null,null,null,null,null,null,null,null,"Fecha desde la cual tiene la calidad de ben. final o existe la condición",null,null,null,null,null,null,null,null,null,null,null,null,null,null,null,null,null,"Fecha desde la cual deja de tener la calidad de ben. final o de existir la condición"]
[]
[null,{"$f":"+B350+1","v":15},"Tipo Novedad"]
[null,{"$f":"+\"Beneficiario \"&B376&\".\"","v":"Beneficiario 15."}]
[null,"Datos de los Beneficiarios Finales"]
[]
[null,"Nombre de la Empresa o Razón Social",null,null,null,null,null,null,null,null,null,null,null,null,null,null,null,null,null,null,null,null,null,null,null,null,null,null,null,null,null,null,null,null,null,null,null,null,null,null,null,null,null,null,null,null,null,null,"NIT - DV",null,null,null,null,null,null,null,null,null,null,"-"]
[]
[null,"Primer Nombre",null,null,null,null,null,null,null,null,null,null,null,null,"Otros Nombres",null,null,null,null,null,null,null,null,null,null,null,null,null,"Primer Apellido",null,null,null,null,null,null,null,null,null,null,null,null,null,null,null,null,"Segundo Apellido"]
[]
[null,"Tipo de Documento",null,null,null,null,null,null,null,null,null,null,null,null,"Número de identificación",null,null,null,null,null,null,null,null,null,null,null,null,null,"País de Expedición de Identificación"]
[]
[null,null,null,null,null,null,null,null,null,null,null,"Número de identificación Tributaria (NIT)",null,null,null,null,null,null,null,null,null,null,null,null,null,null,null,null,"País Expedición (NIT)"]
[]
[null,null,null,null,null,null,null,null,null,null,null,null,"Fecha de Nacimiento (PN)",null,null,null,null,null,null,null,null,null,null,null,null,null,null,null,"País de Nacimiento ",null,null,null,null,null,null,null,null,null,null,null,null,null,null,null,null,"País de Nacionalidad"]
[]
[null,"Dirección Residencia",null,null,null,null,null,null,null,null,null,null,null,null,null,null,null,null,null,"Departamento",null,null,null,null,null,null,null,null,null,null,null,null,null,null,"Municipio",null,null,null,null,null,null,null,null,null,"País de Residencia"]
[]
[null,null,null,null,null,null,null,null,null,null,null,null,null,null,null,null,null,null,null,"Código Postal",null,null,null,null,null,null,null,null,null,null,"Correo electrónico"]
[]
[null,"Beneficiario final de la estructura sin personería jurídica"]
[]
[null,"Fiduciante / Fideicomitente / Constituyente o posición similar o equivalente",null,null,null,null,null,null,null,null,null,null,null,null,null,null,"Comité financiero o posición similar o equivalente",null,null,null,null,null,null,null,null,null,null,null,null,"Fideicomisario / Beneficiario",null,null,null,null,null,null,null,null,null,null,"Ejerce control final y/o efectivo o tiene derecho a gozar y/o disponer de los activos, beneficios, resultados o utilidades"]
[]
[null,null,"Beneficiario Condicionado",null,null,null,null,null,null,null,{"$f":"+IF(AC398=\"\",\"N\",\"S\")","v":"N"},null,null,null,null,"Condiciones que se deben cumplir para tener la calidad de beneficiario final - (Beneficiario Condicionado)"]
[]
[null,"Participación en el capital de la persona jurídica (%)",null,null,null,null,null,null,null,null,null,null,null,null,null,"Fecha desde la cual tiene la calidad de ben. final o existe la condición",null,null,null,null,null,null,null,null,null,null,null,null,null,null,null,null,null,"Fecha desde la cual deja de tener la calidad de ben. final o de existir la condición"]
[]
[null,{"$f":"+B376+1","v":16},"Tipo Novedad"]
[null,{"$f":"+\"Beneficiario \"&B402&\".\"","v":"Beneficiario 16."}]
[null,"Datos de los Beneficiarios Finales"]
[]
[null,"Nombre de la Empresa o Razón Social",null,null,null,null,null,null,null,null,null,null,null,null,null,null,null,null,null,null,null,null,null,null,null,null,null,null,null,null,null,null,null,null,null,null,null,null,null,null,null,null,null,null,null,null,null,null,"NIT - DV",null,null,null,null,null,null,null,null,null,null,"-"]
[]
[null,"Primer Nombre",null,null,null,null,null,null,null,null,null,null,null,null,"Otros Nombres",null,null,null,null,null,null,null,null,null,null,null,null,null,"Primer Apellido",null,null,null,null,null,null,null,null,null,null,null,null,null,null,null,null,"Segundo Apellido"]
[]
[null,"Tipo de Documento",null,null,null,null,null,null,null,null,null,null,null,null,"Número de identificación",null,null,null,null,null,null,null,null,null,null,null,null,null,"País de Expedición de Identificación"]
[]
[null,null,null,null,null,null,null,null,null,null,null,"Número de identificación Tributaria (NIT)",null,null,null,null,null,null,null,null,null,null,null,null,null,null,null,null,"País Expedición (NIT)"]
[]
[null,null,null,null,null,null,null,null,null,null,null,null,"Fecha de Nacimiento (PN)",null,null,null,null,null,null,null,null,null,null,null,null,null,null,null,"País de Nacimiento ",null,null,null,null,null,null,null,null,null,null,null,null,null,null,null,null,"País de Nacionalidad"]
[]
[null,"Dirección Residencia",null,null,null,null,null,null,null,null,null,null,null,null,null,null,null,null,null,"Departamento",null,null,null,null,null,null,null,null,null,null,null,null,null,null,"Municipio",null,null,null,null,null,null,null,null,null,"País de Residencia"]
[]
[null,null,null,null,null,null,null,null,null,null,null,null,null,null,null,null,null,null,null,"Código Postal",null,null,null,null,null,null,null,null,null,null,"Correo electrónico"]
[]
[null,"Beneficiario final de la estructura sin personería jurídica"]
[]
[null,"Fiduciante / Fideicomitente / Constituyente o posición similar o equivalente",null,null,null,null,null,null,null,null,null,null,null,null,null,null,"Comité financiero o posición similar o equivalente",null,null,null,null,null,null,null,null,null,null,null,null,"Fideicomisario / Beneficiario",null,null,null,null,null,null,null,null,null,null,"Ejerce control final y/o efectivo o tiene derecho a gozar y/o disponer de los activos, beneficios, resultados o utilidades"]
[]
[null,null,"Beneficiario Condicionado",null,null,null,null,null,null,null,{"$f":"+IF(AC424=\"\",\"N\",\"S\")","v":"N"},null,null,null,null,"Condiciones que se deben cumplir para tener la calidad de beneficiario final - (Beneficiario Condicionado)"]
[]
[null,"Participación en el capital de la persona jurídica (%)",null,null,null,null,null,null,null,null,null,null,null,null,null,"Fecha desde la cual tiene la calidad de ben. final o existe la condición",null,null,null,null,null,null,null,null,null,null,null,null,null,null,null,null,null,"Fecha desde la cual deja de tener la calidad de ben. final o de existir la condición"]
[]
[null,{"$f":"+B402+1","v":17},"Tipo Novedad"]
[null,{"$f":"+\"Beneficiario \"&B428&\".\"","v":"Beneficiario 17."}]
[null,"Datos de los Beneficiarios Finales"]
[]
[null,"Nombre de la Empresa o Razón Social",null,null,null,null,null,null,null,null,null,null,null,null,null,null,null,null,null,null,null,null,null,null,null,null,null,null,null,null,null,null,null,null,null,null,null,null,null,null,null,null,null,null,null,null,null,null,"NIT - DV",null,null,null,null,null,null,null,null,null,null,"-"]
[]
[null,"Primer Nombre",null,null,null,null,null,null,null,null,null,null,null,null,"Otros Nombres",null,null,null,null,null,null,null,null,null,null,null,null,null,"Primer Apellido",null,null,null,null,null,null,null,null,null,null,null,null,null,null,null,null,"Segundo Apellido"]
[]
[null,"Tipo de Documento",null,null,null,null,null,null,null,null,null,null,null,null,"Número de identificación",null,null,null,null,null,null,null,null,null,null,null,null,null,"País de Expedición de Identificación"]
[]
[null,null,null,null,null,null,null,null,null,null,null,"Número de identificación Tributaria (NIT)",null,null,null,null,null,null,null,null,null,null,null,null,null,null,null,null,"País Expedición (NIT)"]
[]
[null,null,null,null,null,null,null,null,null,null,null,null,"Fecha de Nacimiento (PN)",null,null,null,null,null,null,null,null,null,null,null,null,null,null,null,"País de Nacimiento ",null,null,null,null,null,null,null,null,null,null,null,null,null,null,null,null,"País de Nacionalidad"]
[]
[null,"Dirección Residencia",null,null,null,null,null,null,null,null,null,null,null,null,null,null,null,null,null,"Departamento",null,null,null,null,null,null,null,null,null,null,null,null,null,null,"Municipio",null,null,null,null,null,null,null,null,null,"País de Residencia"]
[]
[null,null,null,null,null,null,null,null,null,null,null,null,null,null,null,null,null,null,null,"Código Postal",null,null,null,null,null,null,null,null,null,null,"Correo electrónico"]
[]
[null,"Beneficiario final de la estructura sin personería jurídica"]
[]
[null,"Fiduciante / Fideicomitente / Constituyente o posición similar o equivalente",null,null,null,null,null,null,null,null,null,null,null,null,null,null,"Comité financiero o posición similar o equivalente",null,null,null,null,null,null,null,null,null,null,null,null,"Fideicomisario / Beneficiario",null,null,null,null,null,null,null,null,null,null,"Ejerce control final y/o efectivo o tiene derecho a gozar y/o disponer de los activos, beneficios, resultados o utilidades"]
[]
[null,null,"Beneficiario Condicionado",null,null,null,null,null,null,null,{"$f":"+IF(AC450=\"\",\"N\",\"S\")","v":"N"},null,null,null,null,"Condiciones que se deben cumplir para tener la calidad de beneficiario final - (Beneficiario Condicionado)"]
[]
[null,"Participación en el capital de la persona jurídica (%)",null,null,null,null,null,null,null,null,null,null,null,null,null,"Fecha desde la cual tiene la calidad de ben. final o existe la condición",null,null,null,null,null,null,null,null,null,null,null,null,null,null,null,null,null,"Fecha desde la cual deja de tener la calidad de ben. final o de existir la condición"]
[]
[null,{"$f":"+B428+1","v":18},"Tipo Novedad"]
[null,{"$f":"+\"Beneficiario \"&B454&\".\"","v":"Beneficiario 18."}]
[null,"Datos de los Beneficiarios Finales"]
[]
[null,"Nombre de la Empresa o Razón Social",null,null,null,null,null,null,null,null,null,null,null,null,null,null,null,null,null,null,null,null,null,null,null,null,null,null,null,null,null,null,null,null,null,null,null,null,null,null,null,null,null,null,null,null,null,null,"NIT - DV",null,null,null,null,null,null,null,null,null,null,"-"]
[]
[null,"Primer Nombre",null,null,null,null,null,null,null,null,null,null,null,null,"Otros Nombres",null,null,null,null,null,null,null,null,null,null,null,null,null,"Primer Apellido",null,null,null,null,null,null,null,null,null,null,null,null,null,null,null,null,"Segundo Apellido"]
[]
[null,"Tipo de Documento",null,null,null,null,null,null,null,null,null,null,null,null,"Número de identificación",null,null,null,null,null,null,null,null,null,null,null,null,null,"País de Expedición de Identificación"]
[]
[null,null,null,null,null,null,null,null,null,null,null,"Número de identificación Tributaria (NIT)",null,null,null,null,null,null,null,null,null,null,null,null,null,null,null,null,"País Expedición (NIT)"]
[]
[null,null,null,null,null,null,null,null,null,null,null,null,"Fecha de Nacimiento (PN)",null,null,null,null,null,null,null,null,null,null,null,null,null,null,null,"País de Nacimiento ",null,null,null,null,null,null,null,null,null,null,null,null,null,null,null,null,"País de Nacionalidad"]
[]
[null,"Dirección Residencia",null,null,null,null,null,null,null,null,null,null,null,null,null,null,null,null,null,"Departamento",null,null,null,null,null,null,null,null,null,null,null,null,null,null,"Municipio",null,null,null,null,null,null,null,null,null,"País de Residencia"]
[]
[null,null,null,null,null,null,null,null,null,null,null,null,null,null,null,null,null,null,null,"Código Postal",null,null,null,null,null,null,null,null,null,null,"Correo electrónico"]
[]
[null,"Beneficiario final de la estructura sin personería jurídica"]
[]
[null,"Fiduciante / Fideicomitente / Constituyente o posición similar o equivalente",null,null,null,null,null,null,null,null,null,null,null,null,null,null,"Comité financiero o posición similar o equivalente",null,null,null,null,null,null,null,null,null,null,null,null,"Fideicomisario / Beneficiario",null,null,null,null,null,null,null,null,null,null,"Ejerce control final y/o efectivo o tiene derecho a gozar y/o disponer de los activos, beneficios, resultados o utilidades"]
[]
[null,null,"Beneficiario Condicionado",null,null,null,null,null,null,null,{"$f":"+IF(AC476=\"\",\"N\",\"S\")","v":"N"},null,null,null,null,"Condiciones que se deben cumplir para tener la calidad de beneficiario final - (Beneficiario Condicionado)"]
[]
[null,"Participación en el capital de la persona jurídica (%)",null,null,null,null,null,null,null,null,null,null,null,null,null,"Fecha desde la cual tiene la calidad de ben. final o existe la condición",null,null,null,null,null,null,null,null,null,null,null,null,null,null,null,null,null,"Fecha desde la cual deja de tener la calidad de ben. final o de existir la condición"]
[]
[null,{"$f":"+B454+1","v":19},"Tipo Novedad"]
[null,{"$f":"+\"Beneficiario \"&B480&\".\"","v":"Beneficiario 19."}]
[null,"Datos de los Beneficiarios Finales"]
[]
[null,"Nombre de la Empresa o Razón Social",null,null,null,null,null,null,null,null,null,null,null,null,null,null,null,null,null,null,null,null,null,null,null,null,null,null,null,null,null,null,null,null,null,null,null,null,null,null,null,null,null,null,null,null,null,null,"NIT - DV",null,null,null,null,null,null,null,null,null,null,"-"]
[]
[null,"Primer Nombre",null,null,null,null,null,null,null,null,null,null,null,null,"Otros Nombres",null,null,null,null,null,null,null,null,null,null,null,null,null,"Primer Apellido",null,null,null,null,null,null,null,null,null,null,null,null,null,null,null,null,"Segundo Apellido"]
[]
[null,"Tipo de Documento",null,null,null,null,null,null,null,null,null,null,null,null,"Número de identificación",null,null,null,null,null,null,null,null,null,null,null,null,null,"País de Expedición de Identificación"]
[]
[null,null,null,null,null,null,null,null,null,null,null,"Número de identificación Tributaria (NIT)",null,null,null,null,null,null,null,null,null,null,null,null,null,null,null,null,"País Expedición (NIT)"]
[]
[null,null,null,null,null,null,null,null,null,null,null,null,"Fecha de Nacimiento (PN)",null,null,null,null,null,null,null,null,null,null,null,null,null,null,null,"País de Nacimiento ",null,null,null,null,null,null,null,null,null,null,null,null,null,null,null,null,"País de Nacionalidad"]
[]
[null,"Dirección Residencia",null,null,null,null,null,null,null,null,null,null,null,null,null,null,null,null,null,"Departamento",null,null,null,null,null,null,null,null,null,null,null,null,null,null,"Municipio",null,null,null,null,null,null,null,null,null,"País de Residencia"]
[]
[null,null,null,null,null,null,null,null,null,null,null,null,null,null,null,null,null,null,null,"Código Postal",null,null,null,null,null,null,null,null,null,null,"Correo electrónico"]
[]
[null,"Beneficiario final de la estructura sin personería jurídica"]
[]
[null,"Fiduciante / Fideicomitente / Constituyente o posición similar o equivalente",null,null,null,null,null,null,null,null,null,null,null,null,null,null,"Comité financiero o posición similar o equivalente",null,null,null,null,null,null,null,null,null,null,null,null,"Fideicomisario / Beneficiario",null,null,null,null,null,null,null,null,null,null,"Ejerce control final y/o efectivo o tiene derecho a gozar y/o disponer de los activos, beneficios, resultados o utilidades"]
[]
[null,null,"Beneficiario Condicionado",null,null,null,null,null,null,null,{"$f":"+IF(AC502=\"\",\"N\",\"S\")","v":"N"},null,null,null,null,"Condiciones que se deben cumplir para tener la calidad de beneficiario final - (Beneficiario Condicionado)"]
[]
[null,"Participación en el capital de la persona jurídica (%)",null,null,null,null,null,null,null,null,null,null,null,null,null,"Fecha desde la cual tiene la calidad de ben. final o existe la condición",null,null,null,null,null,null,null,null,null,null,null,null,null,null,null,null,null,"Fecha desde la cual deja de tener la calidad de ben. final o de existir la condición"]
[]
[null,{"$f":"+B480+1","v":20},"Tipo Novedad"]
[null,{"$f":"+\"Beneficiario \"&B506&\".\"","v":"Beneficiario 20."}]
[null,"Datos de los Beneficiarios Finales"]
[]
[null,"Nombre de la Empresa o Razón Social",null,null,null,null,null,null,null,null,null,null,null,null,null,null,null,null,null,null,null,null,null,null,null,null,null,null,null,null,null,null,null,null,null,null,null,null,null,null,null,null,null,null,null,null,null,null,"NIT - DV",null,null,null,null,null,null,null,null,null,null,"-"]
[]
[null,"Primer Nombre",null,null,null,null,null,null,null,null,null,null,null,null,"Otros Nombres",null,null,null,null,null,null,null,null,null,null,null,null,null,"Primer Apellido",null,null,null,null,null,null,null,null,null,null,null,null,null,null,null,null,"Segundo Apellido"]
[]
[null,"Tipo de Documento",null,null,null,null,null,null,null,null,null,null,null,null,"Número de identificación",null,null,null,null,null,null,null,null,null,null,null,null,null,"País de Expedición de Identificación"]
[]
[null,null,null,null,null,null,null,null,null,null,null,"Número de identificación Tributaria (NIT)",null,null,null,null,null,null,null,null,null,null,null,null,null,null,null,null,"País Expedición (NIT)"]
[]
[null,null,null,null,null,null,null,null,null,null,null,null,"Fecha de Nacimiento (PN)",null,null,null,null,null,null,null,null,null,null,null,null,null,null,null,"País de Nacimiento ",null,null,null,null,null,null,null,null,null,null,null,null,null,null,null,null,"País de Nacionalidad"]
[]
[null,"Dirección Residencia",null,null,null,null,null,null,null,null,null,null,null,null,null,null,null,null,null,"Departamento",null,null,null,null,null,null,null,null,null,null,null,null,null,null,"Municipio",null,null,null,null,null,null,null,null,null,"País de Residencia"]
[]
[null,null,null,null,null,null,null,null,null,null,null,null,null,null,null,null,null,null,null,"Código Postal",null,null,null,null,null,null,null,null,null,null,"Correo electrónico"]
[]
[null,"Beneficiario final de la estructura sin personería jurídica"]
[]
[null,"Fiduciante / Fideicomitente / Constituyente o posición similar o equivalente",null,null,null,null,null,null,null,null,null,null,null,null,null,null,"Comité financiero o posición similar o equivalente",null,null,null,null,null,null,null,null,null,null,null,null,"Fideicomisario / Beneficiario",null,null,null,null,null,null,null,null,null,null,"Ejerce control final y/o efectivo o tiene derecho a gozar y/o disponer de los activos, beneficios, resultados o utilidades"]
[]
[null,null,"Beneficiario Condicionado",null,null,null,null,null,null,null,{"$f":"+IF(AC528=\"\",\"N\",\"S\")","v":"N"},null,null,null,null,"Condiciones que se deben cumplir para tener la calidad de beneficiario final - (Beneficiario Condicionado)"]
[]
[null,"Participación en el capital de la persona jurídica (%)",null,null,null,null,null,null,null,null,null,null,null,null,null,"Fecha desde la cual tiene la calidad de ben. final o existe la condición",null,null,null,null,null,null,null,null,null,null,null,null,null,null,null,null,null,"Fecha desde la cual deja de tener la calidad de ben. final o de existir la condición"]
[]
[null,{"$f":"+B506+1","v":21},"Tipo Novedad"]
[null,{"$f":"+\"Beneficiario \"&B532&\".\"","v":"Beneficiario 21."}]
[null,"Datos de los Beneficiarios Finales"]
[]
[null,"Nombre de la Empresa o Razón Social",null,null,null,null,null,null,null,null,null,null,null,null,null,null,null,null,null,null,null,null,null,null,null,null,null,null,null,null,null,null,null,null,null,null,null,null,null,null,null,null,null,null,null,null,null,null,"NIT - DV",null,null,null,null,null,null,null,null,null,null,"-"]
[]
[null,"Primer Nombre",null,null,null,null,null,null,null,null,null,null,null,null,"Otros Nombres",null,null,null,null,null,null,null,null,null,null,null,null,null,"Primer Apellido",null,null,null,null,null,null,null,null,null,null,null,null,null,null,null,null,"Segundo Apellido"]
[]
[null,"Tipo de Documento",null,null,null,null,null,null,null,null,null,null,null,null,"Número de identificación",null,null,null,null,null,null,null,null,null,null,null,null,null,"País de Expedición de Identificación"]
[]
[null,null,null,null,null,null,null,null,null,null,null,"Número de identificación Tributaria (NIT)",null,null,null,null,null,null,null,null,null,null,null,null,null,null,null,null,"País Expedición (NIT)"]
[]
[null,null,null,null,null,null,null,null,null,null,null,null,"Fecha de Nacimiento (PN)",null,null,null,null,null,null,null,null,null,null,null,null,null,null,null,"País de Nacimiento ",null,null,null,null,null,null,null,null,null,null,null,null,null,null,null,null,"País de Nacionalidad"]
[]
[null,"Dirección Residencia",null,null,null,null,null,null,null,null,null,null,null,null,null,null,null,null,null,"Departamento",null,null,null,null,null,null,null,null,null,null,null,null,null,null,"Municipio",null,null,null,null,null,null,null,null,null,"País de Residencia"]
[]
[null,null,null,null,null,null,null,null,null,null,null,null,null,null,null,null,null,null,null,"Código Postal",null,null,null,null,null,null,null,null,null,null,"Correo electrónico"]
[]
[null,"Beneficiario final de la estructura sin personería jurídica"]
[]
[null,"Fiduciante / Fideicomitente / Constituyente o posición similar o equivalente",null,null,null,null,null,null,null,null,null,null,null,null,null,null,"Comité financiero o posición similar o equivalente",null,null,null,null,null,null,null,null,null,null,null,null,"Fideicomisario / Beneficiario",null,null,null,null,null,null,null,null,null,null,"Ejerce control final y/o efectivo o tiene derecho a gozar y/o disponer de los activos, beneficios, resultados o utilidades"]
[]
[null,null,"Beneficiario Condicionado",null,null,null,null,null,null,null,{"$f":"+IF(AC554=\"\",\"N\",\"S\")","v":"N"},null,null,null,null,"Condiciones que se deben cumplir para tener la calidad de beneficiario final - (Beneficiario Condicionado)"]
[]
[null,"Participación en el capital de la persona jurídica (%)",null,null,null,null,null,null,null,null,null,null,null,null,null,"Fecha desde la cual tiene la calidad de ben. final o existe la condición",null,null,null,null,null,null,null,null,null,null,null,null,null,null,null,null,null,"Fecha desde la cual deja de tener la calidad de ben. final o de existir la condición"]
[]
[null,{"$f":"+B532+1","v":22},"Tipo Novedad"]
[null,{"$f":"+\"Beneficiario \"&B558&\".\"","v":"Beneficiario 22."}]
[null,"Datos de los Beneficiarios Finales"]
[]
[null,"Nombre de la Empresa o Razón Social",null,null,null,null,null,null,null,null,null,null,null,null,null,null,null,null,null,null,null,null,null,null,null,null,null,null,null,null,null,null,null,null,null,null,null,null,null,null,null,null,null,null,null,null,null,null,"NIT - DV",null,null,null,null,null,null,null,null,null,null,"-"]
[]
[null,"Primer Nombre",null,null,null,null,null,null,null,null,null,null,null,null,"Otros Nombres",null,null,null,null,null,null,null,null,null,null,null,null,null,"Primer Apellido",null,null,null,null,null,null,null,null,null,null,null,null,null,null,null,null,"Segundo Apellido"]
[]
[null,"Tipo de Documento",null,null,null,null,null,null,null,null,null,null,null,null,"Número de identificación",null,null,null,null,null,null,null,null,null,null,null,null,null,"País de Expedición de Identificación"]
[]
[null,null,null,null,null,null,null,null,null,null,null,"Número de identificación Tributaria (NIT)",null,null,null,null,null,null,null,null,null,null,null,null,null,null,null,null,"País Expedición (NIT)"]
[]
[null,null,null,null,null,null,null,null,null,null,null,null,"Fecha de Nacimiento (PN)",null,null,null,null,null,null,null,null,null,null,null,null,null,null,null,"País de Nacimiento ",null,null,null,null,null,null,null,null,null,null,null,null,null,null,null,null,"País de Nacionalidad"]
[]
[null,"Dirección Residencia",null,null,null,null,null,null,null,null,null,null,null,null,null,null,null,null,null,"Departamento",null,null,null,null,null,null,null,null,null,null,null,null,null,null,"Municipio",null,null,null,null,null,null,null,null,null,"País de Residencia"]
[]
[null,null,null,null,null,null,null,null,null,null,null,null,null,null,null,null,null,null,null,"Código Postal",null,null,null,null,null,null,null,null,null,null,"Correo electrónico"]
[]
[null,"Beneficiario final de la estructura sin personería jurídica"]
[]
[null,"Fiduciante / Fideicomitente / Constituyente o posición similar o equivalente",null,null,null,null,null,null,null,null,null,null,null,null,null,null,"Comité financiero o posición similar o equivalente",null,null,null,null,null,null,null,null,null,null,null,null,"Fideicomisario / Beneficiario",null,null,null,null,null,null,null,null,null,null,"Ejerce control final y/o efectivo o tiene derecho a gozar y/o disponer de los activos, beneficios, resultados o utilidades"]
[]
[null,null,"Beneficiario Condicionado",null,null,null,null,null,null,null,{"$f":"+IF(AC580=\"\",\"N\",\"S\")","v":"N"},null,null,null,null,"Condiciones que se deben cumplir para tener la calidad de beneficiario final - (Beneficiario Condicionado)"]
[]
[null,"Participación en el capital de la persona jurídica (%)",null,null,null,null,null,null,null,null,null,null,null,null,null,"Fecha desde la cual tiene la calidad de ben. final o existe la condición",null,null,null,null,null,null,null,null,null,null,null,null,null,null,null,null,null,"Fecha desde la cual deja de tener la calidad de ben. final o de existir la condición"]
[]
[null,{"$f":"+B558+1","v":23},"Tipo Novedad"]
[null,{"$f":"+\"Beneficiario \"&B584&\".\"","v":"Beneficiario 23."}]
[null,"Datos de los Beneficiarios Finales"]
[]
[null,"Nombre de la Empresa o Razón Social",null,null,null,null,null,null,null,null,null,null,null,null,null,null,null,null,null,null,null,null,null,null,null,null,null,null,null,null,null,null,null,null,null,null,null,null,null,null,null,null,null,null,null,null,null,null,"NIT - DV",null,null,null,null,null,null,null,null,null,null,"-"]
[]
[null,"Primer Nombre",null,null,null,null,null,null,null,null,null,null,null,null,"Otros Nombres",null,null,null,null,null,null,null,null,null,null,null,null,null,"Primer Apellido",null,null,null,null,null,null,null,null,null,null,null,null,null,null,null,null,"Segundo Apellido"]
[]
[null,"Tipo de Documento",null,null,null,null,null,null,null,null,null,null,null,null,"Número de identificación",null,null,null,null,null,null,null,null,null,null,null,null,null,"País de Expedición de Identificación"]
[]
[null,null,null,null,null,null,null,null,null,null,null,"Número de identificación Tributaria (NIT)",null,null,null,null,null,null,null,null,null,null,null,null,null,null,null,null,"País Expedición (NIT)"]
[]
[null,null,null,null,null,null,null,null,null,null,null,null,"Fecha de Nacimiento (PN)",null,null,null,null,null,null,null,null,null,null,null,null,null,null,null,"País de Nacimiento ",null,null,null,null,null,null,null,null,null,null,null,null,null,null,null,null,"País de Nacionalidad"]
[]
[null,"Dirección Residencia",null,null,null,null,null,null,null,null,null,null,null,null,null,null,null,null,null,"Departamento",null,null,null,null,null,null,null,null,null,null,null,null,null,null,"Municipio",null,null,null,null,null,null,null,null,null,"País de Residencia"]
[]
[null,null,null,null,null,null,null,null,null,null,null,null,null,null,null,null,null,null,null,"Código Postal",null,null,null,null,null,null,null,null,null,null,"Correo electrónico"]
[]
[null,"Beneficiario final de la estructura sin personería jurídica"]
[]
[null,"Fiduciante / Fideicomitente / Constituyente o posición similar o equivalente",null,null,null,null,null,null,null,null,null,null,null,null,null,null,"Comité financiero o posición similar o equivalente",null,null,null,null,null,null,null,null,null,null,null,null,"Fideicomisario / Beneficiario",null,null,null,null,null,null,null,null,null,null,"Ejerce control final y/o efectivo o tiene derecho a gozar y/o disponer de los activos, beneficios, resultados o utilidades"]
[]
[null,null,"Beneficiario Condicionado",null,null,null,null,null,null,null,{"$f":"+IF(AC606=\"\",\"N\",\"S\")","v":"N"},null,null,null,null,"Condiciones que se deben cumplir para tener la calidad de beneficiario final - (Beneficiario Condicionado)"]
[]
[null,"Participación en el capital de la persona jurídica (%)",null,null,null,null,null,null,null,null,null,null,null,null,null,"Fecha desde la cual tiene la calidad de ben. final o existe la condición",null,null,null,null,null,null,null,null,null,null,null,null,null,null,null,null,null,"Fecha desde la cual deja de tener la calidad de ben. final o de existir la condición"]
[]
[null,{"$f":"+B584+1","v":24},"Tipo Novedad"]
[null,{"$f":"+\"Beneficiario \"&B610&\".\"","v":"Beneficiario 24."}]
[null,"Datos de los Beneficiarios Finales"]
[]
[null,"Nombre de la Empresa o Razón Social",null,null,null,null,null,null,null,null,null,null,null,null,null,null,null,null,null,null,null,null,null,null,null,null,null,null,null,null,null,null,null,null,null,null,null,null,null,null,null,null,null,null,null,null,null,null,"NIT - DV",null,null,null,null,null,null,null,null,null,null,"-"]
[]
[null,"Primer Nombre",null,null,null,null,null,null,null,null,null,null,null,null,"Otros Nombres",null,null,null,null,null,null,null,null,null,null,null,null,null,"Primer Apellido",null,null,null,null,null,null,null,null,null,null,null,null,null,null,null,null,"Segundo Apellido"]
[]
[null,"Tipo de Documento",null,null,null,null,null,null,null,null,null,null,null,null,"Número de identificación",null,null,null,null,null,null,null,null,null,null,null,null,null,"País de Expedición de Identificación"]
[]
[null,null,null,null,null,null,null,null,null,null,null,"Número de identificación Tributaria (NIT)",null,null,null,null,null,null,null,null,null,null,null,null,null,null,null,null,"País Expedición (NIT)"]
[]
[null,null,null,null,null,null,null,null,null,null,null,null,"Fecha de Nacimiento (PN)",null,null,null,null,null,null,null,null,null,null,null,null,null,null,null,"País de Nacimiento ",null,null,null,null,null,null,null,null,null,null,null,null,null,null,null,null,"País de Nacionalidad"]
[]
[null,"Dirección Residencia",null,null,null,null,null,null,null,null,null,null,null,null,null,null,null,null,null,"Departamento",null,null,null,null,null,null,null,null,null,null,null,null,null,null,"Municipio",null,null,null,null,null,null,null,null,null,"País de Residencia"]
[]
[null,null,null,null,null,null,null,null,null,null,null,null,null,null,null,null,null,null,null,"Código Postal",null,null,null,null,null,null,null,null,null,null,"Correo electrónico"]
[]
[null,"Beneficiario final de la estructura sin personería jurídica"]
[]
[null,"Fiduciante / Fideicomitente / Constituyente o posición similar o equivalente",null,null,null,null,null,null,null,null,null,null,null,null,null,null,"Comité financiero o posición similar o equivalente",null,null,null,null,null,null,null,null,null,null,null,null,"Fideicomisario / Beneficiario",null,null,null,null,null,null,null,null,null,null,"Ejerce control final y/o efectivo o tiene derecho a gozar y/o disponer de los activos, beneficios, resultados o utilidades"]
[]
[null,null,"Beneficiario Condicionado",null,null,null,null,null,null,null,{"$f":"+IF(AC632=\"\",\"N\",\"S\")","v":"N"},null,null,null,null,"Condiciones que se deben cumplir para tener la calidad de beneficiario final - (Beneficiario Condicionado)"]
[]
[null,"Participación en el capital de la persona jurídica (%)",null,null,null,null,null,null,null,null,null,null,null,null,null,"Fecha desde la cual tiene la calidad de ben. final o existe la condición",null,null,null,null,null,null,null,null,null,null,null,null,null,null,null,null,null,"Fecha desde la cual deja de tener la calidad de ben. final o de existir la condición"]
[]
[null,{"$f":"+B610+1","v":25},"Tipo Novedad"]
[null,{"$f":"+\"Beneficiario \"&B636&\".\"","v":"Beneficiario 25."}]
[null,"Datos de los Beneficiarios Finales"]
[]
[null,"Nombre de la Empresa o Razón Social",null,null,null,null,null,null,null,null,null,null,null,null,null,null,null,null,null,null,null,null,null,null,null,null,null,null,null,null,null,null,null,null,null,null,null,null,null,null,null,null,null,null,null,null,null,null,"NIT - DV",null,null,null,null,null,null,null,null,null,null,"-"]
[]
[null,"Primer Nombre",null,null,null,null,null,null,null,null,null,null,null,null,"Otros Nombres",null,null,null,null,null,null,null,null,null,null,null,null,null,"Primer Apellido",null,null,null,null,null,null,null,null,null,null,null,null,null,null,null,null,"Segundo Apellido"]
[]
[null,"Tipo de Documento",null,null,null,null,null,null,null,null,null,null,null,null,"Número de identificación",null,null,null,null,null,null,null,null,null,null,null,null,null,"País de Expedición de Identificación"]
[]
[null,null,null,null,null,null,null,null,null,null,null,"Número de identificación Tributaria (NIT)",null,null,null,null,null,null,null,null,null,null,null,null,null,null,null,null,"País Expedición (NIT)"]
[]
[null,null,null,null,null,null,null,null,null,null,null,null,"Fecha de Nacimiento (PN)",null,null,null,null,null,null,null,null,null,null,null,null,null,null,null,"País de Nacimiento ",null,null,null,null,null,null,null,null,null,null,null,null,null,null,null,null,"País de Nacionalidad"]
[]
[null,"Dirección Residencia",null,null,null,null,null,null,null,null,null,null,null,null,null,null,null,null,null,"Departamento",null,null,null,null,null,null,null,null,null,null,null,null,null,null,"Municipio",null,null,null,null,null,null,null,null,null,"País de Residencia"]
[]
[null,null,null,null,null,null,null,null,null,null,null,null,null,null,null,null,null,null,null,"Código Postal",null,null,null,null,null,null,null,null,null,null,"Correo electrónico"]
[]
[null,"Beneficiario final de la estructura sin personería jurídica"]
[]
[null,"Fiduciante / Fideicomitente / Constituyente o posición similar o equivalente",null,null,null,null,null,null,null,null,null,null,null,null,null,null,"Comité financiero o posición similar o equivalente",null,null,null,null,null,null,null,null,null,null,null,null,"Fideicomisario / Beneficiario",null,null,null,null,null,null,null,null,null,null,"Ejerce control final y/o efectivo o tiene derecho a gozar y/o disponer de los activos, beneficios, resultados o utilidades"]
[]
[null,null,"Beneficiario Condicionado",null,null,null,null,null,null,null,{"$f":"+IF(AC658=\"\",\"N\",\"S\")","v":"N"},null,null,null,null,"Condiciones que se deben cumplir para tener la calidad de beneficiario final - (Beneficiario Condicionado)"]
[]
[null,"Participación en el capital de la persona jurídica (%)",null,null,null,null,null,null,null,null,null,null,null,null,null,"Fecha desde la cual tiene la calidad de ben. final o existe la condición",null,null,null,null,null,null,null,null,null,null,null,null,null,null,null,null,null,"Fecha desde la cual deja de tener la calidad de ben. final o de existir la condición"]
[]
[null,{"$f":"+B636+1","v":26},"Tipo Novedad"]
[null,{"$f":"+\"Beneficiario \"&B662&\".\"","v":"Beneficiario 26."}]
[null,"Datos de los Beneficiarios Finales"]
[]
[null,"Nombre de la Empresa o Razón Social",null,null,null,null,null,null,null,null,null,null,null,null,null,null,null,null,null,null,null,null,null,null,null,null,null,null,null,null,null,null,null,null,null,null,null,null,null,null,null,null,null,null,null,null,null,null,"NIT - DV",null,null,null,null,null,null,null,null,null,null,"-"]
[]
[null,"Primer Nombre",null,null,null,null,null,null,null,null,null,null,null,null,"Otros Nombres",null,null,null,null,null,null,null,null,null,null,null,null,null,"Primer Apellido",null,null,null,null,null,null,null,null,null,null,null,null,null,null,null,null,"Segundo Apellido"]
[]
[null,"Tipo de Documento",null,null,null,null,null,null,null,null,null,null,null,null,"Número de identificación",null,null,null,null,null,null,null,null,null,null,null,null,null,"País de Expedición de Identificación"]
[]
[null,null,null,null,null,null,null,null,null,null,null,"Número de identificación Tributaria (NIT)",null,null,null,null,null,null,null,null,null,null,null,null,null,null,null,null,"País Expedición (NIT)"]
[]
[null,null,null,null,null,null,null,null,null,null,null,null,"Fecha de Nacimiento (PN)",null,null,null,null,null,null,null,null,null,null,null,null,null,null,null,"País de Nacimiento ",null,null,null,null,null,null,null,null,null,null,null,null,null,null,null,null,"País de Nacionalidad"]
[]
[null,"Dirección Residencia",null,null,null,null,null,null,null,null,null,null,null,null,null,null,null,null,null,"Departamento",null,null,null,null,null,null,null,null,null,null,null,null,null,null,"Municipio",null,null,null,null,null,null,null,null,null,"País de Residencia"]
[]
[null,null,null,null,null,null,null,null,null,null,null,null,null,null,null,null,null,null,null,"Código Postal",null,null,null,null,null,null,null,null,null,null,"Correo electrónico"]
[]
[null,"Beneficiario final de la estructura sin personería jurídica"]
[]
[null,"Fiduciante / Fideicomitente / Constituyente o posición similar o equivalente",null,null,null,null,null,null,null,null,null,null,null,null,null,null,"Comité financiero o posición similar o equivalente",null,null,null,null,null,null,null,null,null,null,null,null,"Fideicomisario / Beneficiario",null,null,null,null,null,null,null,null,null,null,"Ejerce control final y/o efectivo o tiene derecho a gozar y/o disponer de los activos, beneficios, resultados o utilidades"]
[]
[null,null,"Beneficiario Condicionado",null,null,null,null,null,null,null,{"$f":"+IF(AC684=\"\",\"N\",\"S\")","v":"N"},null,null,null,null,"Condiciones que se deben cumplir para tener la calidad de beneficiario final - (Beneficiario Condicionado)"]
[]
[null,"Participación en el capital de la persona jurídica (%)",null,null,null,null,null,null,null,null,null,null,null,null,null,"Fecha desde la cual tiene la calidad de ben. final o existe la condición",null,null,null,null,null,null,null,null,null,null,null,null,null,null,null,null,null,"Fecha desde la cual deja de tener la calidad de ben. final o de existir la condición"]
[]
[null,{"$f":"+B662+1","v":27},"Tipo Novedad"]
[null,{"$f":"+\"Beneficiario \"&B688&\".\"","v":"Beneficiario 27."}]
[null,"Datos de los Beneficiarios Finales"]
[]
[null,"Nombre de la Empresa o Razón Social",null,null,null,null,null,null,null,null,null,null,null,null,null,null,null,null,null,null,null,null,null,null,null,null,null,null,null,null,null,null,null,null,null,null,null,null,null,null,null,null,null,null,null,null,null,null,"NIT - DV",null,null,null,null,null,null,null,null,null,null,"-"]
[]
[null,"Primer Nombre",null,null,null,null,null,null,null,null,null,null,null,null,"Otros Nombres",null,null,null,null,null,null,null,null,null,null,null,null,null,"Primer Apellido",null,null,null,null,null,null,null,null,null,null,null,null,null,null,null,null,"Segundo Apellido"]
[]
[null,"Tipo de Documento",null,null,null,null,null,null,null,null,null,null,null,null,"Número de identificación",null,null,null,null,null,null,null,null,null,null,null,null,null,"País de Expedición de Identificación"]
[]
[null,null,null,null,null,null,null,null,null,null,null,"Número de identificación Tributaria (NIT)",null,null,null,null,null,null,null,null,null,null,null,null,null,null,null,null,"País Expedición (NIT)"]
[]
[null,null,null,null,null,null,null,null,null,null,null,null,"Fecha de Nacimiento (PN)",null,null,null,null,null,null,null,null,null,null,null,null,null,null,null,"País de Nacimiento ",null,null,null,null,null,null,null,null,null,null,null,null,null,null,null,null,"País de Nacionalidad"]
[]
[null,"Dirección Residencia",null,null,null,null,null,null,null,null,null,null,null,null,null,null,null,null,null,"Departamento",null,null,null,null,null,null,null,null,null,null,null,null,null,null,"Municipio",null,null,null,null,null,null,null,null,null,"País de Residencia"]
[]
[null,null,null,null,null,null,null,null,null,null,null,null,null,null,null,null,null,null,null,"Código Postal",null,null,null,null,null,null,null,null,null,null,"Correo electrónico"]
[]
[null,"Beneficiario final de la estructura sin personería jurídica"]
[]
[null,"Fiduciante / Fideicomitente / Constituyente o posición similar o equivalente",null,null,null,null,null,null,null,null,null,null,null,null,null,null,"Comité financiero o posición similar o equivalente",null,null,null,null,null,null,null,null,null,null,null,null,"Fideicomisario / Beneficiario",null,null,null,null,null,null,null,null,null,null,"Ejerce control final y/o efectivo o tiene derecho a gozar y/o disponer de los activos, beneficios, resultados o utilidades"]
[]
[null,null,"Beneficiario Condicionado",null,null,null,null,null,null,null,{"$f":"+IF(AC710=\"\",\"N\",\"S\")","v":"N"},null,null,null,null,"Condiciones que se deben cumplir para tener la calidad de beneficiario final - (Beneficiario Condicionado)"]
[]
[null,"Participación en el capital de la persona jurídica (%)",null,null,null,null,null,null,null,null,null,null,null,null,null,"Fecha desde la cual tiene la calidad de ben. final o existe la condición",null,null,null,null,null,null,null,null,null,null,null,null,null,null,null,null,null,"Fecha desde la cual deja de tener la calidad de ben. final o de existir la condición"]
[]
[null,{"$f":"+B688+1","v":28},"Tipo Novedad"]
[null,{"$f":"+\"Beneficiario \"&B714&\".\"","v":"Beneficiario 28."}]
[null,"Datos de los Beneficiarios Finales"]
[]
[null,"Nombre de la Empresa o Razón Social",null,null,null,null,null,null,null,null,null,null,null,null,null,null,null,null,null,null,null,null,null,null,null,null,null,null,null,null,null,null,null,null,null,null,null,null,null,null,null,null,null,null,null,null,null,null,"NIT - DV",null,null,null,null,null,null,null,null,null,null,"-"]
[]
[null,"Primer Nombre",null,null,null,null,null,null,null,null,null,null,null,null,"Otros Nombres",null,null,null,null,null,null,null,null,null,null,null,null,null,"Primer Apellido",null,null,null,null,null,null,null,null,null,null,null,null,null,null,null,null,"Segundo Apellido"]
[]
[null,"Tipo de Documento",null,null,null,null,null,null,null,null,null,null,null,null,"Número de identificación",null,null,null,null,null,null,null,null,null,null,null,null,null,"País de Expedición de Identificación"]
[]
[null,null,null,null,null,null,null,null,null,null,null,"Número de identificación Tributaria (NIT)",null,null,null,null,null,null,null,null,null,null,null,null,null,null,null,null,"País Expedición (NIT)"]
[]
[null,null,null,null,null,null,null,null,null,null,null,null,"Fecha de Nacimiento (PN)",null,null,null,null,null,null,null,null,null,null,null,null,null,null,null,"País de Nacimiento ",null,null,null,null,null,null,null,null,null,null,null,null,null,null,null,null,"País de Nacionalidad"]
[]
[null,"Dirección Residencia",null,null,null,null,null,null,null,null,null,null,null,null,null,null,null,null,null,"Departamento",null,null,null,null,null,null,null,null,null,null,null,null,null,null,"Municipio",null,null,null,null,null,null,null,null,null,"País de Residencia"]
[]
[null,null,null,null,null,null,null,null,null,null,null,null,null,null,null,null,null,null,null,"Código Postal",null,null,null,null,null,null,null,null,null,null,"Correo electrónico"]
[]
[null,"Beneficiario final de la estructura sin personería jurídica"]
[]
[null,"Fiduciante / Fideicomitente / Constituyente o posición similar o equivalente",null,null,null,null,null,null,null,null,null,null,null,null,null,null,"Comité financiero o posición similar o equivalente",null,null,null,null,null,null,null,null,null,null,null,null,"Fideicomisario / Beneficiario",null,null,null,null,null,null,null,null,null,null,"Ejerce control final y/o efectivo o tiene derecho a gozar y/o disponer de los activos, beneficios, resultados o utilidades"]
[]
[null,null,"Beneficiario Condicionado",null,null,null,null,null,null,null,{"$f":"+IF(AC736=\"\",\"N\",\"S\")","v":"N"},null,null,null,null,"Condiciones que se deben cumplir para tener la calidad de beneficiario final - (Beneficiario Condicionado)"]
[]
[null,"Participación en el capital de la persona jurídica (%)",null,null,null,null,null,null,null,null,null,null,null,null,null,"Fecha desde la cual tiene la calidad de ben. final o existe la condición",null,null,null,null,null,null,null,null,null,null,null,null,null,null,null,null,null,"Fecha desde la cual deja de tener la calidad de ben. final o de existir la condición"]
[]
[null,{"$f":"+B714+1","v":29},"Tipo Novedad"]
[null,{"$f":"+\"Beneficiario \"&B740&\".\"","v":"Beneficiario 29."}]
[null,"Datos de los Beneficiarios Finales"]
[]
[null,"Nombre de la Empresa o Razón Social",null,null,null,null,null,null,null,null,null,null,null,null,null,null,null,null,null,null,null,null,null,null,null,null,null,null,null,null,null,null,null,null,null,null,null,null,null,null,null,null,null,null,null,null,null,null,"NIT - DV",null,null,null,null,null,null,null,null,null,null,"-"]
[]
[null,"Primer Nombre",null,null,null,null,null,null,null,null,null,null,null,null,"Otros Nombres",null,null,null,null,null,null,null,null,null,null,null,null,null,"Primer Apellido",null,null,null,null,null,null,null,null,null,null,null,null,null,null,null,null,"Segundo Apellido"]
[]
[null,"Tipo de Documento",null,null,null,null,null,null,null,null,null,null,null,null,"Número de identificación",null,null,null,null,null,null,null,null,null,null,null,null,null,"País de Expedición de Identificación"]
[]
[null,null,null,null,null,null,null,null,null,null,null,"Número de identificación Tributaria (NIT)",null,null,null,null,null,null,null,null,null,null,null,null,null,null,null,null,"País Expedición (NIT)"]
[]
[null,null,null,null,null,null,null,null,null,null,null,null,"Fecha de Nacimiento (PN)",null,null,null,null,null,null,null,null,null,null,null,null,null,null,null,"País de Nacimiento ",null,null,null,null,null,null,null,null,null,null,null,null,null,null,null,null,"País de Nacionalidad"]
[]
[null,"Dirección Residencia",null,null,null,null,null,null,null,null,null,null,null,null,null,null,null,null,null,"Departamento",null,null,null,null,null,null,null,null,null,null,null,null,null,null,"Municipio",null,null,null,null,null,null,null,null,null,"País de Residencia"]
[]
[null,null,null,null,null,null,null,null,null,null,null,null,null,null,null,null,null,null,null,"Código Postal",null,null,null,null,null,null,null,null,null,null,"Correo electrónico"]
[]
[null,"Beneficiario final de la estructura sin personería jurídica"]
[]
[null,"Fiduciante / Fideicomitente / Constituyente o posición similar o equivalente",null,null,null,null,null,null,null,null,null,null,null,null,null,null,"Comité financiero o posición similar o equivalente",null,null,null,null,null,null,null,null,null,null,null,null,"Fideicomisario / Beneficiario",null,null,null,null,null,null,null,null,null,null,"Ejerce control final y/o efectivo o tiene derecho a gozar y/o disponer de los activos, beneficios, resultados o utilidades"]
[]
[null,null,"Beneficiario Condicionado",null,null,null,null,null,null,null,{"$f":"+IF(AC762=\"\",\"N\",\"S\")","v":"N"},null,null,null,null,"Condiciones que se deben cumplir para tener la calidad de beneficiario final - (Beneficiario Condicionado)"]
[]
[null,"Participación en el capital de la persona jurídica (%)",null,null,null,null,null,null,null,null,null,null,null,null,null,"Fecha desde la cual tiene la calidad de ben. final o existe la condición",null,null,null,null,null,null,null,null,null,null,null,null,null,null,null,null,null,"Fecha desde la cual deja de tener la calidad de ben. final o de existir la condición"]
[]
[null,{"$f":"+B740+1","v":30},"Tipo Novedad"]
[null,{"$f":"+\"Beneficiario \"&B766&\".\"","v":"Beneficiario 30."}]
[null,"Datos de los Beneficiarios Finales"]
[]
[null,"Nombre de la Empresa o Razón Social",null,null,null,null,null,null,null,null,null,null,null,null,null,null,null,null,null,null,null,null,null,null,null,null,null,null,null,null,null,null,null,null,null,null,null,null,null,null,null,null,null,null,null,null,null,null,"NIT - DV",null,null,null,null,null,null,null,null,null,null,"-"]
[]
[null,"Primer Nombre",null,null,null,null,null,null,null,null,null,null,null,null,"Otros Nombres",null,null,null,null,null,null,null,null,null,null,null,null,null,"Primer Apellido",null,null,null,null,null,null,null,null,null,null,null,null,null,null,null,null,"Segundo Apellido"]
[]
[null,"Tipo de Documento",null,null,null,null,null,null,null,null,null,null,null,null,"Número de identificación",null,null,null,null,null,null,null,null,null,null,null,null,null,"País de Expedición de Identificación"]
[]
[null,null,null,null,null,null,null,null,null,null,null,"Número de identificación Tributaria (NIT)",null,null,null,null,null,null,null,null,null,null,null,null,null,null,null,null,"País Expedición (NIT)"]
[]
[null,null,null,null,null,null,null,null,null,null,null,null,"Fecha de Nacimiento (PN)",null,null,null,null,null,null,null,null,null,null,null,null,null,null,null,"País de Nacimiento ",null,null,null,null,null,null,null,null,null,null,null,null,null,null,null,null,"País de Nacionalidad"]
[]
[null,"Dirección Residencia",null,null,null,null,null,null,null,null,null,null,null,null,null,null,null,null,null,"Departamento",null,null,null,null,null,null,null,null,null,null,null,null,null,null,"Municipio",null,null,null,null,null,null,null,null,null,"País de Residencia"]
[]
[null,null,null,null,null,null,null,null,null,null,null,null,null,null,null,null,null,null,null,"Código Postal",null,null,null,null,null,null,null,null,null,null,"Correo electrónico"]
[]
[null,"Beneficiario final de la estructura sin personería jurídica"]
[]
[null,"Fiduciante / Fideicomitente / Constituyente o posición similar o equivalente",null,null,null,null,null,null,null,null,null,null,null,null,null,null,"Comité financiero o posición similar o equivalente",null,null,null,null,null,null,null,null,null,null,null,null,"Fideicomisario / Beneficiario",null,null,null,null,null,null,null,null,null,null,"Ejerce control final y/o efectivo o tiene derecho a gozar y/o disponer de los activos, beneficios, resultados o utilidades"]
[]
[null,null,"Beneficiario Condicionado",null,null,null,null,null,null,null,{"$f":"+IF(AC788=\"\",\"N\",\"S\")","v":"N"},null,null,null,null,"Condiciones que se deben cumplir para tener la calidad de beneficiario final - (Beneficiario Condicionado)"]
[]
[null,"Participación en el capital de la persona jurídica (%)",null,null,null,null,null,null,null,null,null,null,null,null,null,"Fecha desde la cual tiene la calidad de ben. final o existe la condición",null,null,null,null,null,null,null,null,null,null,null,null,null,null,null,null,null,"Fecha desde la cual deja de tener la calidad de ben. final o de existir la condición"]
[]
[null,{"$f":"+B766+1","v":31},"Tipo Novedad"]
[null,{"$f":"+\"Beneficiario \"&B792&\".\"","v":"Beneficiario 31."}]
[null,"Datos de los Beneficiarios Finales"]
[]
[null,"Nombre de la Empresa o Razón Social",null,null,null,null,null,null,null,null,null,null,null,null,null,null,null,null,null,null,null,null,null,null,null,null,null,null,null,null,null,null,null,null,null,null,null,null,null,null,null,null,null,null,null,null,null,null,"NIT - DV",null,null,null,null,null,null,null,null,null,null,"-"]
[]
[null,"Primer Nombre",null,null,null,null,null,null,null,null,null,null,null,null,"Otros Nombres",null,null,null,null,null,null,null,null,null,null,null,null,null,"Primer Apellido",null,null,null,null,null,null,null,null,null,null,null,null,null,null,null,null,"Segundo Apellido"]
[]
[null,"Tipo de Documento",null,null,null,null,null,null,null,null,null,null,null,null,"Número de identificación",null,null,null,null,null,null,null,null,null,null,null,null,null,"País de Expedición de Identificación"]
[]
[null,null,null,null,null,null,null,null,null,null,null,"Número de identificación Tributaria (NIT)",null,null,null,null,null,null,null,null,null,null,null,null,null,null,null,null,"País Expedición (NIT)"]
[]
[null,null,null,null,null,null,null,null,null,null,null,null,"Fecha de Nacimiento (PN)",null,null,null,null,null,null,null,null,null,null,null,null,null,null,null,"País de Nacimiento ",null,null,null,null,null,null,null,null,null,null,null,null,null,null,null,null,"País de Nacionalidad"]
[]
[null,"Dirección Residencia",null,null,null,null,null,null,null,null,null,null,null,null,null,null,null,null,null,"Departamento",null,null,null,null,null,null,null,null,null,null,null,null,null,null,"Municipio",null,null,null,null,null,null,null,null,null,"País de Residencia"]
[]
[null,null,null,null,null,null,null,null,null,null,null,null,null,null,null,null,null,null,null,"Código Postal",null,null,null,null,null,null,null,null,null,null,"Correo electrónico"]
[]
[null,"Beneficiario final de la estructura sin personería jurídica"]
[]
[null,"Fiduciante / Fideicomitente / Constituyente o posición similar o equivalente",null,null,null,null,null,null,null,null,null,null,null,null,null,null,"Comité financiero o posición similar o equivalente",null,null,null,null,null,null,null,null,null,null,null,null,"Fideicomisario / Beneficiario",null,null,null,null,null,null,null,null,null,null,"Ejerce control final y/o efectivo o tiene derecho a gozar y/o disponer de los activos, beneficios, resultados o utilidades"]
[]
[null,null,"Beneficiario Condicionado",null,null,null,null,null,null,null,{"$f":"+IF(AC814=\"\",\"N\",\"S\")","v":"N"},null,null,null,null,"Condiciones que se deben cumplir para tener la calidad de beneficiario final - (Beneficiario Condicionado)"]
[]
[null,"Participación en el capital de la persona jurídica (%)",null,null,null,null,null,null,null,null,null,null,null,null,null,"Fecha desde la cual tiene la calidad de ben. final o existe la condición",null,null,null,null,null,null,null,null,null,null,null,null,null,null,null,null,null,"Fecha desde la cual deja de tener la calidad de ben. final o de existir la condición"]
[]
[null,{"$f":"+B792+1","v":32},"Tipo Novedad"]
[null,{"$f":"+\"Beneficiario \"&B818&\".\"","v":"Beneficiario 32."}]
[null,"Datos de los Beneficiarios Finales"]
[]
[null,"Nombre de la Empresa o Razón Social",null,null,null,null,null,null,null,null,null,null,null,null,null,null,null,null,null,null,null,null,null,null,null,null,null,null,null,null,null,null,null,null,null,null,null,null,null,null,null,null,null,null,null,null,null,null,"NIT - DV",null,null,null,null,null,null,null,null,null,null,"-"]
[]
[null,"Primer Nombre",null,null,null,null,null,null,null,null,null,null,null,null,"Otros Nombres",null,null,null,null,null,null,null,null,null,null,null,null,null,"Primer Apellido",null,null,null,null,null,null,null,null,null,null,null,null,null,null,null,null,"Segundo Apellido"]
[]
[null,"Tipo de Documento",null,null,null,null,null,null,null,null,null,null,null,null,"Número de identificación",null,null,null,null,null,null,null,null,null,null,null,null,null,"País de Expedición de Identificación"]
[]
[null,null,null,null,null,null,null,null,null,null,null,"Número de identificación Tributaria (NIT)",null,null,null,null,null,null,null,null,null,null,null,null,null,null,null,null,"País Expedición (NIT)"]
[]
[null,null,null,null,null,null,null,null,null,null,null,null,"Fecha de Nacimiento (PN)",null,null,null,null,null,null,null,null,null,null,null,null,null,null,null,"País de Nacimiento ",null,null,null,null,null,null,null,null,null,null,null,null,null,null,null,null,"País de Nacionalidad"]
[]
[null,"Dirección Residencia",null,null,null,null,null,null,null,null,null,null,null,null,null,null,null,null,null,"Departamento",null,null,null,null,null,null,null,null,null,null,null,null,null,null,"Municipio",null,null,null,null,null,null,null,null,null,"País de Residencia"]
[]
[null,null,null,null,null,null,null,null,null,null,null,null,null,null,null,null,null,null,null,"Código Postal",null,null,null,null,null,null,null,null,null,null,"Correo electrónico"]
[]
[null,"Beneficiario final de la estructura sin personería jurídica"]
[]
[null,"Fiduciante / Fideicomitente / Constituyente o posición similar o equivalente",null,null,null,null,null,null,null,null,null,null,null,null,null,null,"Comité financiero o posición similar o equivalente",null,null,null,null,null,null,null,null,null,null,null,null,"Fideicomisario / Beneficiario",null,null,null,null,null,null,null,null,null,null,"Ejerce control final y/o efectivo o tiene derecho a gozar y/o disponer de los activos, beneficios, resultados o utilidades"]
[]
[null,null,"Beneficiario Condicionado",null,null,null,null,null,null,null,{"$f":"+IF(AC840=\"\",\"N\",\"S\")","v":"N"},null,null,null,null,"Condiciones que se deben cumplir para tener la calidad de beneficiario final - (Beneficiario Condicionado)"]
[]
[null,"Participación en el capital de la persona jurídica (%)",null,null,null,null,null,null,null,null,null,null,null,null,null,"Fecha desde la cual tiene la calidad de ben. final o existe la condición",null,null,null,null,null,null,null,null,null,null,null,null,null,null,null,null,null,"Fecha desde la cual deja de tener la calidad de ben. final o de existir la condición"]
[]
[null,{"$f":"+B818+1","v":33},"Tipo Novedad"]
[null,{"$f":"+\"Beneficiario \"&B844&\".\"","v":"Beneficiario 33."}]
[null,"Datos de los Beneficiarios Finales"]
[]
[null,"Nombre de la Empresa o Razón Social",null,null,null,null,null,null,null,null,null,null,null,null,null,null,null,null,null,null,null,null,null,null,null,null,null,null,null,null,null,null,null,null,null,null,null,null,null,null,null,null,null,null,null,null,null,null,"NIT - DV",null,null,null,null,null,null,null,null,null,null,"-"]
[]
[null,"Primer Nombre",null,null,null,null,null,null,null,null,null,null,null,null,"Otros Nombres",null,null,null,null,null,null,null,null,null,null,null,null,null,"Primer Apellido",null,null,null,null,null,null,null,null,null,null,null,null,null,null,null,null,"Segundo Apellido"]
[]
[null,"Tipo de Documento",null,null,null,null,null,null,null,null,null,null,null,null,"Número de identificación",null,null,null,null,null,null,null,null,null,null,null,null,null,"País de Expedición de Identificación"]
[]
[null,null,null,null,null,null,null,null,null,null,null,"Número de identificación Tributaria (NIT)",null,null,null,null,null,null,null,null,null,null,null,null,null,null,null,null,"País Expedición (NIT)"]
[]
[null,null,null,null,null,null,null,null,null,null,null,null,"Fecha de Nacimiento (PN)",null,null,null,null,null,null,null,null,null,null,null,null,null,null,null,"País de Nacimiento ",null,null,null,null,null,null,null,null,null,null,null,null,null,null,null,null,"País de Nacionalidad"]
[]
[null,"Dirección Residencia",null,null,null,null,null,null,null,null,null,null,null,null,null,null,null,null,null,"Departamento",null,null,null,null,null,null,null,null,null,null,null,null,null,null,"Municipio",null,null,null,null,null,null,null,null,null,"País de Residencia"]
[]
[null,null,null,null,null,null,null,null,null,null,null,null,null,null,null,null,null,null,null,"Código Postal",null,null,null,null,null,null,null,null,null,null,"Correo electrónico"]
[]
[null,"Beneficiario final de la estructura sin personería jurídica"]
[]
[null,"Fiduciante / Fideicomitente / Constituyente o posición similar o equivalente",null,null,null,null,null,null,null,null,null,null,null,null,null,null,"Comité financiero o posición similar o equivalente",null,null,null,null,null,null,null,null,null,null,null,null,"Fideicomisario / Beneficiario",null,null,null,null,null,null,null,null,null,null,"Ejerce control final y/o efectivo o tiene derecho a gozar y/o disponer de los activos, beneficios, resultados o utilidades"]
[]
[null,null,"Beneficiario Condicionado",null,null,null,null,null,null,null,{"$f":"+IF(AC866=\"\",\"N\",\"S\")","v":"N"},null,null,null,null,"Condiciones que se deben cumplir para tener la calidad de beneficiario final - (Beneficiario Condicionado)"]
[]
[null,"Participación en el capital de la persona jurídica (%)",null,null,null,null,null,null,null,null,null,null,null,null,null,"Fecha desde la cual tiene la calidad de ben. final o existe la condición",null,null,null,null,null,null,null,null,null,null,null,null,null,null,null,null,null,"Fecha desde la cual deja de tener la calidad de ben. final o de existir la condición"]
[]
[null,{"$f":"+B844+1","v":34},"Tipo Novedad"]
[null,{"$f":"+\"Beneficiario \"&B870&\".\"","v":"Beneficiario 34."}]
[null,"Datos de los Beneficiarios Finales"]
[]
[null,"Nombre de la Empresa o Razón Social",null,null,null,null,null,null,null,null,null,null,null,null,null,null,null,null,null,null,null,null,null,null,null,null,null,null,null,null,null,null,null,null,null,null,null,null,null,null,null,null,null,null,null,null,null,null,"NIT - DV",null,null,null,null,null,null,null,null,null,null,"-"]
[]
[null,"Primer Nombre",null,null,null,null,null,null,null,null,null,null,null,null,"Otros Nombres",null,null,null,null,null,null,null,null,null,null,null,null,null,"Primer Apellido",null,null,null,null,null,null,null,null,null,null,null,null,null,null,null,null,"Segundo Apellido"]
[]
[null,"Tipo de Documento",null,null,null,null,null,null,null,null,null,null,null,null,"Número de identificación",null,null,null,null,null,null,null,null,null,null,null,null,null,"País de Expedición de Identificación"]
[]
[null,null,null,null,null,null,null,null,null,null,null,"Número de identificación Tributaria (NIT)",null,null,null,null,null,null,null,null,null,null,null,null,null,null,null,null,"País Expedición (NIT)"]
[]
[null,null,null,null,null,null,null,null,null,null,null,null,"Fecha de Nacimiento (PN)",null,null,null,null,null,null,null,null,null,null,null,null,null,null,null,"País de Nacimiento ",null,null,null,null,null,null,null,null,null,null,null,null,null,null,null,null,"País de Nacionalidad"]
[]
[null,"Dirección Residencia",null,null,null,null,null,null,null,null,null,null,null,null,null,null,null,null,null,"Departamento",null,null,null,null,null,null,null,null,null,null,null,null,null,null,"Municipio",null,null,null,null,null,null,null,null,null,"País de Residencia"]
[]
[null,null,null,null,null,null,null,null,null,null,null,null,null,null,null,null,null,null,null,"Código Postal",null,null,null,null,null,null,null,null,null,null,"Correo electrónico"]
[]
[null,"Beneficiario final de la estructura sin personería jurídica"]
[]
[null,"Fiduciante / Fideicomitente / Constituyente o posición similar o equivalente",null,null,null,null,null,null,null,null,null,null,null,null,null,null,"Comité financiero o posición similar o equivalente",null,null,null,null,null,null,null,null,null,null,null,null,"Fideicomisario / Beneficiario",null,null,null,null,null,null,null,null,null,null,"Ejerce control final y/o efectivo o tiene derecho a gozar y/o disponer de los activos, beneficios, resultados o utilidades"]
[]
[null,null,"Beneficiario Condicionado",null,null,null,null,null,null,null,{"$f":"+IF(AC892=\"\",\"N\",\"S\")","v":"N"},null,null,null,null,"Condiciones que se deben cumplir para tener la calidad de beneficiario final - (Beneficiario Condicionado)"]
[]
[null,"Participación en el capital de la persona jurídica (%)",null,null,null,null,null,null,null,null,null,null,null,null,null,"Fecha desde la cual tiene la calidad de ben. final o existe la condición",null,null,null,null,null,null,null,null,null,null,null,null,null,null,null,null,null,"Fecha desde la cual deja de tener la calidad de ben. final o de existir la condición"]
[]
[null,{"$f":"+B870+1","v":35},"Tipo Novedad"]
[null,{"$f":"+\"Beneficiario \"&B896&\".\"","v":"Beneficiario 35."}]
[null,"Datos de los Beneficiarios Finales"]
[]
[null,"Nombre de la Empresa o Razón Social",null,null,null,null,null,null,null,null,null,null,null,null,null,null,null,null,null,null,null,null,null,null,null,null,null,null,null,null,null,null,null,null,null,null,null,null,null,null,null,null,null,null,null,null,null,null,"NIT - DV",null,null,null,null,null,null,null,null,null,null,"-"]
[]
[null,"Primer Nombre",null,null,null,null,null,null,null,null,null,null,null,null,"Otros Nombres",null,null,null,null,null,null,null,null,null,null,null,null,null,"Primer Apellido",null,null,null,null,null,null,null,null,null,null,null,null,null,null,null,null,"Segundo Apellido"]
[]
[null,"Tipo de Documento",null,null,null,null,null,null,null,null,null,null,null,null,"Número de identificación",null,null,null,null,null,null,null,null,null,null,null,null,null,"País de Expedición de Identificación"]
[]
[null,null,null,null,null,null,null,null,null,null,null,"Número de identificación Tributaria (NIT)",null,null,null,null,null,null,null,null,null,null,null,null,null,null,null,null,"País Expedición (NIT)"]
[]
[null,null,null,null,null,null,null,null,null,null,null,null,"Fecha de Nacimiento (PN)",null,null,null,null,null,null,null,null,null,null,null,null,null,null,null,"País de Nacimiento ",null,null,null,null,null,null,null,null,null,null,null,null,null,null,null,null,"País de Nacionalidad"]
[]
[null,"Dirección Residencia",null,null,null,null,null,null,null,null,null,null,null,null,null,null,null,null,null,"Departamento",null,null,null,null,null,null,null,null,null,null,null,null,null,null,"Municipio",null,null,null,null,null,null,null,null,null,"País de Residencia"]
[]
[null,null,null,null,null,null,null,null,null,null,null,null,null,null,null,null,null,null,null,"Código Postal",null,null,null,null,null,null,null,null,null,null,"Correo electrónico"]
[]
[null,"Beneficiario final de la estructura sin personería jurídica"]
[]
[null,"Fiduciante / Fideicomitente / Constituyente o posición similar o equivalente",null,null,null,null,null,null,null,null,null,null,null,null,null,null,"Comité financiero o posición similar o equivalente",null,null,null,null,null,null,null,null,null,null,null,null,"Fideicomisario / Beneficiario",null,null,null,null,null,null,null,null,null,null,"Ejerce control final y/o efectivo o tiene derecho a gozar y/o disponer de los activos, beneficios, resultados o utilidades"]
[]
[null,null,"Beneficiario Condicionado",null,null,null,null,null,null,null,{"$f":"+IF(AC918=\"\",\"N\",\"S\")","v":"N"},null,null,null,null,"Condiciones que se deben cumplir para tener la calidad de beneficiario final - (Beneficiario Condicionado)"]
[]
[null,"Participación en el capital de la persona jurídica (%)",null,null,null,null,null,null,null,null,null,null,null,null,null,"Fecha desde la cual tiene la calidad de ben. final o existe la condición",null,null,null,null,null,null,null,null,null,null,null,null,null,null,null,null,null,"Fecha desde la cual deja de tener la calidad de ben. final o de existir la condición"]
[]
[null,{"$f":"+B896+1","v":36},"Tipo Novedad"]
[null,{"$f":"+\"Beneficiario \"&B922&\".\"","v":"Beneficiario 36."}]
[null,"Datos de los Beneficiarios Finales"]
[]
[null,"Nombre de la Empresa o Razón Social",null,null,null,null,null,null,null,null,null,null,null,null,null,null,null,null,null,null,null,null,null,null,null,null,null,null,null,null,null,null,null,null,null,null,null,null,null,null,null,null,null,null,null,null,null,null,"NIT - DV",null,null,null,null,null,null,null,null,null,null,"-"]
[]
[null,"Primer Nombre",null,null,null,null,null,null,null,null,null,null,null,null,"Otros Nombres",null,null,null,null,null,null,null,null,null,null,null,null,null,"Primer Apellido",null,null,null,null,null,null,null,null,null,null,null,null,null,null,null,null,"Segundo Apellido"]
[]
[null,"Tipo de Documento",null,null,null,null,null,null,null,null,null,null,null,null,"Número de identificación",null,null,null,null,null,null,null,null,null,null,null,null,null,"País de Expedición de Identificación"]
[]
[null,null,null,null,null,null,null,null,null,null,null,"Número de identificación Tributaria (NIT)",null,null,null,null,null,null,null,null,null,null,null,null,null,null,null,null,"País Expedición (NIT)"]
[]
[null,null,null,null,null,null,null,null,null,null,null,null,"Fecha de Nacimiento (PN)",null,null,null,null,null,null,null,null,null,null,null,null,null,null,null,"País de Nacimiento ",null,null,null,null,null,null,null,null,null,null,null,null,null,null,null,null,"País de Nacionalidad"]
[]
[null,"Dirección Residencia",null,null,null,null,null,null,null,null,null,null,null,null,null,null,null,null,null,"Departamento",null,null,null,null,null,null,null,null,null,null,null,null,null,null,"Municipio",null,null,null,null,null,null,null,null,null,"País de Residencia"]
[]
[null,null,null,null,null,null,null,null,null,null,null,null,null,null,null,null,null,null,null,"Código Postal",null,null,null,null,null,null,null,null,null,null,"Correo electrónico"]
[]
[null,"Beneficiario final de la estructura sin personería jurídica"]
[]
[null,"Fiduciante / Fideicomitente / Constituyente o posición similar o equivalente",null,null,null,null,null,null,null,null,null,null,null,null,null,null,"Comité financiero o posición similar o equivalente",null,null,null,null,null,null,null,null,null,null,null,null,"Fideicomisario / Beneficiario",null,null,null,null,null,null,null,null,null,null,"Ejerce control final y/o efectivo o tiene derecho a gozar y/o disponer de los activos, beneficios, resultados o utilidades"]
[]
[null,null,"Beneficiario Condicionado",null,null,null,null,null,null,null,{"$f":"+IF(AC944=\"\",\"N\",\"S\")","v":"N"},null,null,null,null,"Condiciones que se deben cumplir para tener la calidad de beneficiario final - (Beneficiario Condicionado)"]
[]
[null,"Participación en el capital de la persona jurídica (%)",null,null,null,null,null,null,null,null,null,null,null,null,null,"Fecha desde la cual tiene la calidad de ben. final o existe la condición",null,null,null,null,null,null,null,null,null,null,null,null,null,null,null,null,null,"Fecha desde la cual deja de tener la calidad de ben. final o de existir la condición"]
[]
[null,{"$f":"+B922+1","v":37},"Tipo Novedad"]
[null,{"$f":"+\"Beneficiario \"&B948&\".\"","v":"Beneficiario 37."}]
[null,"Datos de los Beneficiarios Finales"]
[]
[null,"Nombre de la Empresa o Razón Social",null,null,null,null,null,null,null,null,null,null,null,null,null,null,null,null,null,null,null,null,null,null,null,null,null,null,null,null,null,null,null,null,null,null,null,null,null,null,null,null,null,null,null,null,null,null,"NIT - DV",null,null,null,null,null,null,null,null,null,null,"-"]
[]
[null,"Primer Nombre",null,null,null,null,null,null,null,null,null,null,null,null,"Otros Nombres",null,null,null,null,null,null,null,null,null,null,null,null,null,"Primer Apellido",null,null,null,null,null,null,null,null,null,null,null,null,null,null,null,null,"Segundo Apellido"]
[]
[null,"Tipo de Documento",null,null,null,null,null,null,null,null,null,null,null,null,"Número de identificación",null,null,null,null,null,null,null,null,null,null,null,null,null,"País de Expedición de Identificación"]
[]
[null,null,null,null,null,null,null,null,null,null,null,"Número de identificación Tributaria (NIT)",null,null,null,null,null,null,null,null,null,null,null,null,null,null,null,null,"País Expedición (NIT)"]
[]
[null,null,null,null,null,null,null,null,null,null,null,null,"Fecha de Nacimiento (PN)",null,null,null,null,null,null,null,null,null,null,null,null,null,null,null,"País de Nacimiento ",null,null,null,null,null,null,null,null,null,null,null,null,null,null,null,null,"País de Nacionalidad"]
[]
[null,"Dirección Residencia",null,null,null,null,null,null,null,null,null,null,null,null,null,null,null,null,null,"Departamento",null,null,null,null,null,null,null,null,null,null,null,null,null,null,"Municipio",null,null,null,null,null,null,null,null,null,"País de Residencia"]
[]
[null,null,null,null,null,null,null,null,null,null,null,null,null,null,null,null,null,null,null,"Código Postal",null,null,null,null,null,null,null,null,null,null,"Correo electrónico"]
[]
[null,"Beneficiario final de la estructura sin personería jurídica"]
[]
[null,"Fiduciante / Fideicomitente / Constituyente o posición similar o equivalente",null,null,null,null,null,null,null,null,null,null,null,null,null,null,"Comité financiero o posición similar o equivalente",null,null,null,null,null,null,null,null,null,null,null,null,"Fideicomisario / Beneficiario",null,null,null,null,null,null,null,null,null,null,"Ejerce control final y/o efectivo o tiene derecho a gozar y/o disponer de los activos, beneficios, resultados o utilidades"]
[]
[null,null,"Beneficiario Condicionado",null,null,null,null,null,null,null,{"$f":"+IF(AC970=\"\",\"N\",\"S\")","v":"N"},null,null,null,null,"Condiciones que se deben cumplir para tener la calidad de beneficiario final - (Beneficiario Condicionado)"]
[]
[null,"Participación en el capital de la persona jurídica (%)",null,null,null,null,null,null,null,null,null,null,null,null,null,"Fecha desde la cual tiene la calidad de ben. final o existe la condición",null,null,null,null,null,null,null,null,null,null,null,null,null,null,null,null,null,"Fecha desde la cual deja de tener la calidad de ben. final o de existir la condición"]
[]
[null,{"$f":"+B948+1","v":38},"Tipo Novedad"]
[null,{"$f":"+\"Beneficiario \"&B974&\".\"","v":"Beneficiario 38."}]
[null,"Datos de los Beneficiarios Finales"]
[]
[null,"Nombre de la Empresa o Razón Social",null,null,null,null,null,null,null,null,null,null,null,null,null,null,null,null,null,null,null,null,null,null,null,null,null,null,null,null,null,null,null,null,null,null,null,null,null,null,null,null,null,null,null,null,null,null,"NIT - DV",null,null,null,null,null,null,null,null,null,null,"-"]
[]
[null,"Primer Nombre",null,null,null,null,null,null,null,null,null,null,null,null,"Otros Nombres",null,null,null,null,null,null,null,null,null,null,null,null,null,"Primer Apellido",null,null,null,null,null,null,null,null,null,null,null,null,null,null,null,null,"Segundo Apellido"]
[]
[null,"Tipo de Documento",null,null,null,null,null,null,null,null,null,null,null,null,"Número de identificación",null,null,null,null,null,null,null,null,null,null,null,null,null,"País de Expedición de Identificación"]
[]
[null,null,null,null,null,null,null,null,null,null,null,"Número de identificación Tributaria (NIT)",null,null,null,null,null,null,null,null,null,null,null,null,null,null,null,null,"País Expedición (NIT)"]
[]
[null,null,null,null,null,null,null,null,null,null,null,null,"Fecha de Nacimiento (PN)",null,null,null,null,null,null,null,null,null,null,null,null,null,null,null,"País de Nacimiento ",null,null,null,null,null,null,null,null,null,null,null,null,null,null,null,null,"País de Nacionalidad"]
[]
[null,"Dirección Residencia",null,null,null,null,null,null,null,null,null,null,null,null,null,null,null,null,null,"Departamento",null,null,null,null,null,null,null,null,null,null,null,null,null,null,"Municipio",null,null,null,null,null,null,null,null,null,"País de Residencia"]
[]
[null,null,null,null,null,null,null,null,null,null,null,null,null,null,null,null,null,null,null,"Código Postal",null,null,null,null,null,null,null,null,null,null,"Correo electrónico"]
[]
[null,"Beneficiario final de la estructura sin personería jurídica"]
[]
[null,"Fiduciante / Fideicomitente / Constituyente o posición similar o equivalente",null,null,null,null,null,null,null,null,null,null,null,null,null,null,"Comité financiero o posición similar o equivalente",null,null,null,null,null,null,null,null,null,null,null,null,"Fideicomisario / Beneficiario",null,null,null,null,null,null,null,null,null,null,"Ejerce control final y/o efectivo o tiene derecho a gozar y/o disponer de los activos, beneficios, resultados o utilidades"]
[]
[null,null,"Beneficiario Condicionado",null,null,null,null,null,null,null,{"$f":"+IF(AC996=\"\",\"N\",\"S\")","v":"N"},null,null,null,null,"Condiciones que se deben cumplir para tener la calidad de beneficiario final - (Beneficiario Condicionado)"]
[]
[null,"Participación en el capital de la persona jurídica (%)",null,null,null,null,null,null,null,null,null,null,null,null,null,"Fecha desde la cual tiene la calidad de ben. final o existe la condición",null,null,null,null,null,null,null,null,null,null,null,null,null,null,null,null,null,"Fecha desde la cual deja de tener la calidad de ben. final o de existir la condición"]
[]
[null,{"$f":"+B974+1","v":39},"Tipo Novedad"]
[null,{"$f":"+\"Beneficiario \"&B1000&\".\"","v":"Beneficiario 39."}]
[null,"Datos de los Beneficiarios Finales"]
[]
[null,"Nombre de la Empresa o Razón Social",null,null,null,null,null,null,null,null,null,null,null,null,null,null,null,null,null,null,null,null,null,null,null,null,null,null,null,null,null,null,null,null,null,null,null,null,null,null,null,null,null,null,null,null,null,null,"NIT - DV",null,null,null,null,null,null,null,null,null,null,"-"]
[]
[null,"Primer Nombre",null,null,null,null,null,null,null,null,null,null,null,null,"Otros Nombres",null,null,null,null,null,null,null,null,null,null,null,null,null,"Primer Apellido",null,null,null,null,null,null,null,null,null,null,null,null,null,null,null,null,"Segundo Apellido"]
[]
[null,"Tipo de Documento",null,null,null,null,null,null,null,null,null,null,null,null,"Número de identificación",null,null,null,null,null,null,null,null,null,null,null,null,null,"País de Expedición de Identificación"]
[]
[null,null,null,null,null,null,null,null,null,null,null,"Número de identificación Tributaria (NIT)",null,null,null,null,null,null,null,null,null,null,null,null,null,null,null,null,"País Expedición (NIT)"]
[]
[null,null,null,null,null,null,null,null,null,null,null,null,"Fecha de Nacimiento (PN)",null,null,null,null,null,null,null,null,null,null,null,null,null,null,null,"País de Nacimiento ",null,null,null,null,null,null,null,null,null,null,null,null,null,null,null,null,"País de Nacionalidad"]
[]
[null,"Dirección Residencia",null,null,null,null,null,null,null,null,null,null,null,null,null,null,null,null,null,"Departamento",null,null,null,null,null,null,null,null,null,null,null,null,null,null,"Municipio",null,null,null,null,null,null,null,null,null,"País de Residencia"]
[]
[null,null,null,null,null,null,null,null,null,null,null,null,null,null,null,null,null,null,null,"Código Postal",null,null,null,null,null,null,null,null,null,null,"Correo electrónico"]
[]
[null,"Beneficiario final de la estructura sin personería jurídica"]
[]
[null,"Fiduciante / Fideicomitente / Constituyente o posición similar o equivalente",null,null,null,null,null,null,null,null,null,null,null,null,null,null,"Comité financiero o posición similar o equivalente",null,null,null,null,null,null,null,null,null,null,null,null,"Fideicomisario / Beneficiario",null,null,null,null,null,null,null,null,null,null,"Ejerce control final y/o efectivo o tiene derecho a gozar y/o disponer de los activos, beneficios, resultados o utilidades"]
[]
[null,null,"Beneficiario Condicionado",null,null,null,null,null,null,null,{"$f":"+IF(AC1022=\"\",\"N\",\"S\")","v":"N"},null,null,null,null,"Condiciones que se deben cumplir para tener la calidad de beneficiario final - (Beneficiario Condicionado)"]
[]
[null,"Participación en el capital de la persona jurídica (%)",null,null,null,null,null,null,null,null,null,null,null,null,null,"Fecha desde la cual tiene la calidad de ben. final o existe la condición",null,null,null,null,null,null,null,null,null,null,null,null,null,null,null,null,null,"Fecha desde la cual deja de tener la calidad de ben. final o de existir la condición"]
[]
[null,{"$f":"+B1000+1","v":40},"Tipo Novedad"]
[null,{"$f":"+\"Beneficiario \"&B1026&\".\"","v":"Beneficiario 40."}]
[null,"Datos de los Beneficiarios Finales"]
[]
[null,"Nombre de la Empresa o Razón Social",null,null,null,null,null,null,null,null,null,null,null,null,null,null,null,null,null,null,null,null,null,null,null,null,null,null,null,null,null,null,null,null,null,null,null,null,null,null,null,null,null,null,null,null,null,null,"NIT - DV",null,null,null,null,null,null,null,null,null,null,"-"]
[]
[null,"Primer Nombre",null,null,null,null,null,null,null,null,null,null,null,null,"Otros Nombres",null,null,null,null,null,null,null,null,null,null,null,null,null,"Primer Apellido",null,null,null,null,null,null,null,null,null,null,null,null,null,null,null,null,"Segundo Apellido"]
[]
[null,"Tipo de Documento",null,null,null,null,null,null,null,null,null,null,null,null,"Número de identificación",null,null,null,null,null,null,null,null,null,null,null,null,null,"País de Expedición de Identificación"]
[]
[null,null,null,null,null,null,null,null,null,null,null,"Número de identificación Tributaria (NIT)",null,null,null,null,null,null,null,null,null,null,null,null,null,null,null,null,"País Expedición (NIT)"]
[]
[null,null,null,null,null,null,null,null,null,null,null,null,"Fecha de Nacimiento (PN)",null,null,null,null,null,null,null,null,null,null,null,null,null,null,null,"País de Nacimiento ",null,null,null,null,null,null,null,null,null,null,null,null,null,null,null,null,"País de Nacionalidad"]
[]
[null,"Dirección Residencia",null,null,null,null,null,null,null,null,null,null,null,null,null,null,null,null,null,"Departamento",null,null,null,null,null,null,null,null,null,null,null,null,null,null,"Municipio",null,null,null,null,null,null,null,null,null,"País de Residencia"]
[]
[null,null,null,null,null,null,null,null,null,null,null,null,null,null,null,null,null,null,null,"Código Postal",null,null,null,null,null,null,null,null,null,null,"Correo electrónico"]
[]
[null,"Beneficiario final de la estructura sin personería jurídica"]
[]
[null,"Fiduciante / Fideicomitente / Constituyente o posición similar o equivalente",null,null,null,null,null,null,null,null,null,null,null,null,null,null,"Comité financiero o posición similar o equivalente",null,null,null,null,null,null,null,null,null,null,null,null,"Fideicomisario / Beneficiario",null,null,null,null,null,null,null,null,null,null,"Ejerce control final y/o efectivo o tiene derecho a gozar y/o disponer de los activos, beneficios, resultados o utilidades"]
[]
[null,null,"Beneficiario Condicionado",null,null,null,null,null,null,null,{"$f":"+IF(AC1048=\"\",\"N\",\"S\")","v":"N"},null,null,null,null,"Condiciones que se deben cumplir para tener la calidad de beneficiario final - (Beneficiario Condicionado)"]
[]
[null,"Participación en el capital de la persona jurídica (%)",null,null,null,null,null,null,null,null,null,null,null,null,null,"Fecha desde la cual tiene la calidad de ben. final o existe la condición",null,null,null,null,null,null,null,null,null,null,null,null,null,null,null,null,null,"Fecha desde la cual deja de tener la calidad de ben. final o de existir la condición"]
[]
[null,{"$f":"+B1026+1","v":41},"Tipo Novedad"]
[null,{"$f":"+\"Beneficiario \"&B1052&\".\"","v":"Beneficiario 41."}]
[null,"Datos de los Beneficiarios Finales"]
[]
[null,"Nombre de la Empresa o Razón Social",null,null,null,null,null,null,null,null,null,null,null,null,null,null,null,null,null,null,null,null,null,null,null,null,null,null,null,null,null,null,null,null,null,null,null,null,null,null,null,null,null,null,null,null,null,null,"NIT - DV",null,null,null,null,null,null,null,null,null,null,"-"]
[]
[null,"Primer Nombre",null,null,null,null,null,null,null,null,null,null,null,null,"Otros Nombres",null,null,null,null,null,null,null,null,null,null,null,null,null,"Primer Apellido",null,null,null,null,null,null,null,null,null,null,null,null,null,null,null,null,"Segundo Apellido"]
[]
[null,"Tipo de Documento",null,null,null,null,null,null,null,null,null,null,null,null,"Número de identificación",null,null,null,null,null,null,null,null,null,null,null,null,null,"País de Expedición de Identificación"]
[]
[null,null,null,null,null,null,null,null,null,null,null,"Número de identificación Tributaria (NIT)",null,null,null,null,null,null,null,null,null,null,null,null,null,null,null,null,"País Expedición (NIT)"]
[]
[null,null,null,null,null,null,null,null,null,null,null,null,"Fecha de Nacimiento (PN)",null,null,null,null,null,null,null,null,null,null,null,null,null,null,null,"País de Nacimiento ",null,null,null,null,null,null,null,null,null,null,null,null,null,null,null,null,"País de Nacionalidad"]
[]
[null,"Dirección Residencia",null,null,null,null,null,null,null,null,null,null,null,null,null,null,null,null,null,"Departamento",null,null,null,null,null,null,null,null,null,null,null,null,null,null,"Municipio",null,null,null,null,null,null,null,null,null,"País de Residencia"]
[]
[null,null,null,null,null,null,null,null,null,null,null,null,null,null,null,null,null,null,null,"Código Postal",null,null,null,null,null,null,null,null,null,null,"Correo electrónico"]
[]
[null,"Beneficiario final de la estructura sin personería jurídica"]
[]
[null,"Fiduciante / Fideicomitente / Constituyente o posición similar o equivalente",null,null,null,null,null,null,null,null,null,null,null,null,null,null,"Comité financiero o posición similar o equivalente",null,null,null,null,null,null,null,null,null,null,null,null,"Fideicomisario / Beneficiario",null,null,null,null,null,null,null,null,null,null,"Ejerce control final y/o efectivo o tiene derecho a gozar y/o disponer de los activos, beneficios, resultados o utilidades"]
[]
[null,null,"Beneficiario Condicionado",null,null,null,null,null,null,null,{"$f":"+IF(AC1074=\"\",\"N\",\"S\")","v":"N"},null,null,null,null,"Condiciones que se deben cumplir para tener la calidad de beneficiario final - (Beneficiario Condicionado)"]
[]
[null,"Participación en el capital de la persona jurídica (%)",null,null,null,null,null,null,null,null,null,null,null,null,null,"Fecha desde la cual tiene la calidad de ben. final o existe la condición",null,null,null,null,null,null,null,null,null,null,null,null,null,null,null,null,null,"Fecha desde la cual deja de tener la calidad de ben. final o de existir la condición"]
[]
[null,{"$f":"+B1052+1","v":42},"Tipo Novedad"]
[null,{"$f":"+\"Beneficiario \"&B1078&\".\"","v":"Beneficiario 42."}]
[null,"Datos de los Beneficiarios Finales"]
[]
[null,"Nombre de la Empresa o Razón Social",null,null,null,null,null,null,null,null,null,null,null,null,null,null,null,null,null,null,null,null,null,null,null,null,null,null,null,null,null,null,null,null,null,null,null,null,null,null,null,null,null,null,null,null,null,null,"NIT - DV",null,null,null,null,null,null,null,null,null,null,"-"]
[]
[null,"Primer Nombre",null,null,null,null,null,null,null,null,null,null,null,null,"Otros Nombres",null,null,null,null,null,null,null,null,null,null,null,null,null,"Primer Apellido",null,null,null,null,null,null,null,null,null,null,null,null,null,null,null,null,"Segundo Apellido"]
[]
[null,"Tipo de Documento",null,null,null,null,null,null,null,null,null,null,null,null,"Número de identificación",null,null,null,null,null,null,null,null,null,null,null,null,null,"País de Expedición de Identificación"]
[]
[null,null,null,null,null,null,null,null,null,null,null,"Número de identificación Tributaria (NIT)",null,null,null,null,null,null,null,null,null,null,null,null,null,null,null,null,"País Expedición (NIT)"]
[]
[null,null,null,null,null,null,null,null,null,null,null,null,"Fecha de Nacimiento (PN)",null,null,null,null,null,null,null,null,null,null,null,null,null,null,null,"País de Nacimiento ",null,null,null,null,null,null,null,null,null,null,null,null,null,null,null,null,"País de Nacionalidad"]
[]
[null,"Dirección Residencia",null,null,null,null,null,null,null,null,null,null,null,null,null,null,null,null,null,"Departamento",null,null,null,null,null,null,null,null,null,null,null,null,null,null,"Municipio",null,null,null,null,null,null,null,null,null,"País de Residencia"]
[]
[null,null,null,null,null,null,null,null,null,null,null,null,null,null,null,null,null,null,null,"Código Postal",null,null,null,null,null,null,null,null,null,null,"Correo electrónico"]
[]
[null,"Beneficiario final de la estructura sin personería jurídica"]
[]
[null,"Fiduciante / Fideicomitente / Constituyente o posición similar o equivalente",null,null,null,null,null,null,null,null,null,null,null,null,null,null,"Comité financiero o posición similar o equivalente",null,null,null,null,null,null,null,null,null,null,null,null,"Fideicomisario / Beneficiario",null,null,null,null,null,null,null,null,null,null,"Ejerce control final y/o efectivo o tiene derecho a gozar y/o disponer de los activos, beneficios, resultados o utilidades"]
[]
[null,null,"Beneficiario Condicionado",null,null,null,null,null,null,null,{"$f":"+IF(AC1100=\"\",\"N\",\"S\")","v":"N"},null,null,null,null,"Condiciones que se deben cumplir para tener la calidad de beneficiario final - (Beneficiario Condicionado)"]
[]
[null,"Participación en el capital de la persona jurídica (%)",null,null,null,null,null,null,null,null,null,null,null,null,null,"Fecha desde la cual tiene la calidad de ben. final o existe la condición",null,null,null,null,null,null,null,null,null,null,null,null,null,null,null,null,null,"Fecha desde la cual deja de tener la calidad de ben. final o de existir la condición"]
[]
[null,{"$f":"+B1078+1","v":43},"Tipo Novedad"]
[null,{"$f":"+\"Beneficiario \"&B1104&\".\"","v":"Beneficiario 43."}]
[null,"Datos de los Beneficiarios Finales"]
[]
[null,"Nombre de la Empresa o Razón Social",null,null,null,null,null,null,null,null,null,null,null,null,null,null,null,null,null,null,null,null,null,null,null,null,null,null,null,null,null,null,null,null,null,null,null,null,null,null,null,null,null,null,null,null,null,null,"NIT - DV",null,null,null,null,null,null,null,null,null,null,"-"]
[]
[null,"Primer Nombre",null,null,null,null,null,null,null,null,null,null,null,null,"Otros Nombres",null,null,null,null,null,null,null,null,null,null,null,null,null,"Primer Apellido",null,null,null,null,null,null,null,null,null,null,null,null,null,null,null,null,"Segundo Apellido"]
[]
[null,"Tipo de Documento",null,null,null,null,null,null,null,null,null,null,null,null,"Número de identificación",null,null,null,null,null,null,null,null,null,null,null,null,null,"País de Expedición de Identificación"]
[]
[null,null,null,null,null,null,null,null,null,null,null,"Número de identificación Tributaria (NIT)",null,null,null,null,null,null,null,null,null,null,null,null,null,null,null,null,"País Expedición (NIT)"]
[]
[null,null,null,null,null,null,null,null,null,null,null,null,"Fecha de Nacimiento (PN)",null,null,null,null,null,null,null,null,null,null,null,null,null,null,null,"País de Nacimiento ",null,null,null,null,null,null,null,null,null,null,null,null,null,null,null,null,"País de Nacionalidad"]
[]
[null,"Dirección Residencia",null,null,null,null,null,null,null,null,null,null,null,null,null,null,null,null,null,"Departamento",null,null,null,null,null,null,null,null,null,null,null,null,null,null,"Municipio",null,null,null,null,null,null,null,null,null,"País de Residencia"]
[]
[null,null,null,null,null,null,null,null,null,null,null,null,null,null,null,null,null,null,null,"Código Postal",null,null,null,null,null,null,null,null,null,null,"Correo electrónico"]
[]
[null,"Beneficiario final de la estructura sin personería jurídica"]
[]
[null,"Fiduciante / Fideicomitente / Constituyente o posición similar o equivalente",null,null,null,null,null,null,null,null,null,null,null,null,null,null,"Comité financiero o posición similar o equivalente",null,null,null,null,null,null,null,null,null,null,null,null,"Fideicomisario / Beneficiario",null,null,null,null,null,null,null,null,null,null,"Ejerce control final y/o efectivo o tiene derecho a gozar y/o disponer de los activos, beneficios, resultados o utilidades"]
[]
[null,null,"Beneficiario Condicionado",null,null,null,null,null,null,null,{"$f":"+IF(AC1126=\"\",\"N\",\"S\")","v":"N"},null,null,null,null,"Condiciones que se deben cumplir para tener la calidad de beneficiario final - (Beneficiario Condicionado)"]
[]
[null,"Participación en el capital de la persona jurídica (%)",null,null,null,null,null,null,null,null,null,null,null,null,null,"Fecha desde la cual tiene la calidad de ben. final o existe la condición",null,null,null,null,null,null,null,null,null,null,null,null,null,null,null,null,null,"Fecha desde la cual deja de tener la calidad de ben. final o de existir la condición"]
[]
[null,{"$f":"+B1104+1","v":44},"Tipo Novedad"]
[null,{"$f":"+\"Beneficiario \"&B1130&\".\"","v":"Beneficiario 44."}]
[null,"Datos de los Beneficiarios Finales"]
[]
[null,"Nombre de la Empresa o Razón Social",null,null,null,null,null,null,null,null,null,null,null,null,null,null,null,null,null,null,null,null,null,null,null,null,null,null,null,null,null,null,null,null,null,null,null,null,null,null,null,null,null,null,null,null,null,null,"NIT - DV",null,null,null,null,null,null,null,null,null,null,"-"]
[]
[null,"Primer Nombre",null,null,null,null,null,null,null,null,null,null,null,null,"Otros Nombres",null,null,null,null,null,null,null,null,null,null,null,null,null,"Primer Apellido",null,null,null,null,null,null,null,null,null,null,null,null,null,null,null,null,"Segundo Apellido"]
[]
[null,"Tipo de Documento",null,null,null,null,null,null,null,null,null,null,null,null,"Número de identificación",null,null,null,null,null,null,null,null,null,null,null,null,null,"País de Expedición de Identificación"]
[]
[null,null,null,null,null,null,null,null,null,null,null,"Número de identificación Tributaria (NIT)",null,null,null,null,null,null,null,null,null,null,null,null,null,null,null,null,"País Expedición (NIT)"]
[]
[null,null,null,null,null,null,null,null,null,null,null,null,"Fecha de Nacimiento (PN)",null,null,null,null,null,null,null,null,null,null,null,null,null,null,null,"País de Nacimiento ",null,null,null,null,null,null,null,null,null,null,null,null,null,null,null,null,"País de Nacionalidad"]
[]
[null,"Dirección Residencia",null,null,null,null,null,null,null,null,null,null,null,null,null,null,null,null,null,"Departamento",null,null,null,null,null,null,null,null,null,null,null,null,null,null,"Municipio",null,null,null,null,null,null,null,null,null,"País de Residencia"]
[]
[null,null,null,null,null,null,null,null,null,null,null,null,null,null,null,null,null,null,null,"Código Postal",null,null,null,null,null,null,null,null,null,null,"Correo electrónico"]
[]
[null,"Beneficiario final de la estructura sin personería jurídica"]
[]
[null,"Fiduciante / Fideicomitente / Constituyente o posición similar o equivalente",null,null,null,null,null,null,null,null,null,null,null,null,null,null,"Comité financiero o posición similar o equivalente",null,null,null,null,null,null,null,null,null,null,null,null,"Fideicomisario / Beneficiario",null,null,null,null,null,null,null,null,null,null,"Ejerce control final y/o efectivo o tiene derecho a gozar y/o disponer de los activos, beneficios, resultados o utilidades"]
[]
[null,null,"Beneficiario Condicionado",null,null,null,null,null,null,null,{"$f":"+IF(AC1152=\"\",\"N\",\"S\")","v":"N"},null,null,null,null,"Condiciones que se deben cumplir para tener la calidad de beneficiario final - (Beneficiario Condicionado)"]
[]
[null,"Participación en el capital de la persona jurídica (%)",null,null,null,null,null,null,null,null,null,null,null,null,null,"Fecha desde la cual tiene la calidad de ben. final o existe la condición",null,null,null,null,null,null,null,null,null,null,null,null,null,null,null,null,null,"Fecha desde la cual deja de tener la calidad de ben. final o de existir la condición"]
[]
[null,{"$f":"+B1130+1","v":45},"Tipo Novedad"]
[null,{"$f":"+\"Beneficiario \"&B1156&\".\"","v":"Beneficiario 45."}]
[null,"Datos de los Beneficiarios Finales"]
[]
[null,"Nombre de la Empresa o Razón Social",null,null,null,null,null,null,null,null,null,null,null,null,null,null,null,null,null,null,null,null,null,null,null,null,null,null,null,null,null,null,null,null,null,null,null,null,null,null,null,null,null,null,null,null,null,null,"NIT - DV",null,null,null,null,null,null,null,null,null,null,"-"]
[]
[null,"Primer Nombre",null,null,null,null,null,null,null,null,null,null,null,null,"Otros Nombres",null,null,null,null,null,null,null,null,null,null,null,null,null,"Primer Apellido",null,null,null,null,null,null,null,null,null,null,null,null,null,null,null,null,"Segundo Apellido"]
[]
[null,"Tipo de Documento",null,null,null,null,null,null,null,null,null,null,null,null,"Número de identificación",null,null,null,null,null,null,null,null,null,null,null,null,null,"País de Expedición de Identificación"]
[]
[null,null,null,null,null,null,null,null,null,null,null,"Número de identificación Tributaria (NIT)",null,null,null,null,null,null,null,null,null,null,null,null,null,null,null,null,"País Expedición (NIT)"]
[]
[null,null,null,null,null,null,null,null,null,null,null,null,"Fecha de Nacimiento (PN)",null,null,null,null,null,null,null,null,null,null,null,null,null,null,null,"País de Nacimiento ",null,null,null,null,null,null,null,null,null,null,null,null,null,null,null,null,"País de Nacionalidad"]
[]
[null,"Dirección Residencia",null,null,null,null,null,null,null,null,null,null,null,null,null,null,null,null,null,"Departamento",null,null,null,null,null,null,null,null,null,null,null,null,null,null,"Municipio",null,null,null,null,null,null,null,null,null,"País de Residencia"]
[]
[null,null,null,null,null,null,null,null,null,null,null,null,null,null,null,null,null,null,null,"Código Postal",null,null,null,null,null,null,null,null,null,null,"Correo electrónico"]
[]
[null,"Beneficiario final de la estructura sin personería jurídica"]
[]
[null,"Fiduciante / Fideicomitente / Constituyente o posición similar o equivalente",null,null,null,null,null,null,null,null,null,null,null,null,null,null,"Comité financiero o posición similar o equivalente",null,null,null,null,null,null,null,null,null,null,null,null,"Fideicomisario / Beneficiario",null,null,null,null,null,null,null,null,null,null,"Ejerce control final y/o efectivo o tiene derecho a gozar y/o disponer de los activos, beneficios, resultados o utilidades"]
[]
[null,null,"Beneficiario Condicionado",null,null,null,null,null,null,null,{"$f":"+IF(AC1178=\"\",\"N\",\"S\")","v":"N"},null,null,null,null,"Condiciones que se deben cumplir para tener la calidad de beneficiario final - (Beneficiario Condicionado)"]
[]
[null,"Participación en el capital de la persona jurídica (%)",null,null,null,null,null,null,null,null,null,null,null,null,null,"Fecha desde la cual tiene la calidad de ben. final o existe la condición",null,null,null,null,null,null,null,null,null,null,null,null,null,null,null,null,null,"Fecha desde la cual deja de tener la calidad de ben. final o de existir la condición"]
[]
[null,{"$f":"+B1156+1","v":46},"Tipo Novedad"]
[null,{"$f":"+\"Beneficiario \"&B1182&\".\"","v":"Beneficiario 46."}]
[null,"Datos de los Beneficiarios Finales"]
[]
[null,"Nombre de la Empresa o Razón Social",null,null,null,null,null,null,null,null,null,null,null,null,null,null,null,null,null,null,null,null,null,null,null,null,null,null,null,null,null,null,null,null,null,null,null,null,null,null,null,null,null,null,null,null,null,null,"NIT - DV",null,null,null,null,null,null,null,null,null,null,"-"]
[]
[null,"Primer Nombre",null,null,null,null,null,null,null,null,null,null,null,null,"Otros Nombres",null,null,null,null,null,null,null,null,null,null,null,null,null,"Primer Apellido",null,null,null,null,null,null,null,null,null,null,null,null,null,null,null,null,"Segundo Apellido"]
[]
[null,"Tipo de Documento",null,null,null,null,null,null,null,null,null,null,null,null,"Número de identificación",null,null,null,null,null,null,null,null,null,null,null,null,null,"País de Expedición de Identificación"]
[]
[null,null,null,null,null,null,null,null,null,null,null,"Número de identificación Tributaria (NIT)",null,null,null,null,null,null,null,null,null,null,null,null,null,null,null,null,"País Expedición (NIT)"]
[]
[null,null,null,null,null,null,null,null,null,null,null,null,"Fecha de Nacimiento (PN)",null,null,null,null,null,null,null,null,null,null,null,null,null,null,null,"País de Nacimiento ",null,null,null,null,null,null,null,null,null,null,null,null,null,null,null,null,"País de Nacionalidad"]
[]
[null,"Dirección Residencia",null,null,null,null,null,null,null,null,null,null,null,null,null,null,null,null,null,"Departamento",null,null,null,null,null,null,null,null,null,null,null,null,null,null,"Municipio",null,null,null,null,null,null,null,null,null,"País de Residencia"]
[]
[null,null,null,null,null,null,null,null,null,null,null,null,null,null,null,null,null,null,null,"Código Postal",null,null,null,null,null,null,null,null,null,null,"Correo electrónico"]
[]
[null,"Beneficiario final de la estructura sin personería jurídica"]
[]
[null,"Fiduciante / Fideicomitente / Constituyente o posición similar o equivalente",null,null,null,null,null,null,null,null,null,null,null,null,null,null,"Comité financiero o posición similar o equivalente",null,null,null,null,null,null,null,null,null,null,null,null,"Fideicomisario / Beneficiario",null,null,null,null,null,null,null,null,null,null,"Ejerce control final y/o efectivo o tiene derecho a gozar y/o disponer de los activos, beneficios, resultados o utilidades"]
[]
[null,null,"Beneficiario Condicionado",null,null,null,null,null,null,null,{"$f":"+IF(AC1204=\"\",\"N\",\"S\")","v":"N"},null,null,null,null,"Condiciones que se deben cumplir para tener la calidad de beneficiario final - (Beneficiario Condicionado)"]
[]
[null,"Participación en el capital de la persona jurídica (%)",null,null,null,null,null,null,null,null,null,null,null,null,null,"Fecha desde la cual tiene la calidad de ben. final o existe la condición",null,null,null,null,null,null,null,null,null,null,null,null,null,null,null,null,null,"Fecha desde la cual deja de tener la calidad de ben. final o de existir la condición"]
[]
[null,{"$f":"+B1182+1","v":47},"Tipo Novedad"]
[null,{"$f":"+\"Beneficiario \"&B1208&\".\"","v":"Beneficiario 47."}]
[null,"Datos de los Beneficiarios Finales"]
[]
[null,"Nombre de la Empresa o Razón Social",null,null,null,null,null,null,null,null,null,null,null,null,null,null,null,null,null,null,null,null,null,null,null,null,null,null,null,null,null,null,null,null,null,null,null,null,null,null,null,null,null,null,null,null,null,null,"NIT - DV",null,null,null,null,null,null,null,null,null,null,"-"]
[]
[null,"Primer Nombre",null,null,null,null,null,null,null,null,null,null,null,null,"Otros Nombres",null,null,null,null,null,null,null,null,null,null,null,null,null,"Primer Apellido",null,null,null,null,null,null,null,null,null,null,null,null,null,null,null,null,"Segundo Apellido"]
[]
[null,"Tipo de Documento",null,null,null,null,null,null,null,null,null,null,null,null,"Número de identificación",null,null,null,null,null,null,null,null,null,null,null,null,null,"País de Expedición de Identificación"]
[]
[null,null,null,null,null,null,null,null,null,null,null,"Número de identificación Tributaria (NIT)",null,null,null,null,null,null,null,null,null,null,null,null,null,null,null,null,"País Expedición (NIT)"]
[]
[null,null,null,null,null,null,null,null,null,null,null,null,"Fecha de Nacimiento (PN)",null,null,null,null,null,null,null,null,null,null,null,null,null,null,null,"País de Nacimiento ",null,null,null,null,null,null,null,null,null,null,null,null,null,null,null,null,"País de Nacionalidad"]
[]
[null,"Dirección Residencia",null,null,null,null,null,null,null,null,null,null,null,null,null,null,null,null,null,"Departamento",null,null,null,null,null,null,null,null,null,null,null,null,null,null,"Municipio",null,null,null,null,null,null,null,null,null,"País de Residencia"]
[]
[null,null,null,null,null,null,null,null,null,null,null,null,null,null,null,null,null,null,null,"Código Postal",null,null,null,null,null,null,null,null,null,null,"Correo electrónico"]
[]
[null,"Beneficiario final de la estructura sin personería jurídica"]
[]
[null,"Fiduciante / Fideicomitente / Constituyente o posición similar o equivalente",null,null,null,null,null,null,null,null,null,null,null,null,null,null,"Comité financiero o posición similar o equivalente",null,null,null,null,null,null,null,null,null,null,null,null,"Fideicomisario / Beneficiario",null,null,null,null,null,null,null,null,null,null,"Ejerce control final y/o efectivo o tiene derecho a gozar y/o disponer de los activos, beneficios, resultados o utilidades"]
[]
[null,null,"Beneficiario Condicionado",null,null,null,null,null,null,null,{"$f":"+IF(AC1230=\"\",\"N\",\"S\")","v":"N"},null,null,null,null,"Condiciones que se deben cumplir para tener la calidad de beneficiario final - (Beneficiario Condicionado)"]
[]
[null,"Participación en el capital de la persona jurídica (%)",null,null,null,null,null,null,null,null,null,null,null,null,null,"Fecha desde la cual tiene la calidad de ben. final o existe la condición",null,null,null,null,null,null,null,null,null,null,null,null,null,null,null,null,null,"Fecha desde la cual deja de tener la calidad de ben. final o de existir la condición"]
[]
[null,{"$f":"+B1208+1","v":48},"Tipo Novedad"]
[null,{"$f":"+\"Beneficiario \"&B1234&\".\"","v":"Beneficiario 48."}]
[null,"Datos de los Beneficiarios Finales"]
[]
[null,"Nombre de la Empresa o Razón Social",null,null,null,null,null,null,null,null,null,null,null,null,null,null,null,null,null,null,null,null,null,null,null,null,null,null,null,null,null,null,null,null,null,null,null,null,null,null,null,null,null,null,null,null,null,null,"NIT - DV",null,null,null,null,null,null,null,null,null,null,"-"]
[]
[null,"Primer Nombre",null,null,null,null,null,null,null,null,null,null,null,null,"Otros Nombres",null,null,null,null,null,null,null,null,null,null,null,null,null,"Primer Apellido",null,null,null,null,null,null,null,null,null,null,null,null,null,null,null,null,"Segundo Apellido"]
[]
[null,"Tipo de Documento",null,null,null,null,null,null,null,null,null,null,null,null,"Número de identificación",null,null,null,null,null,null,null,null,null,null,null,null,null,"País de Expedición de Identificación"]
[]
[null,null,null,null,null,null,null,null,null,null,null,"Número de identificación Tributaria (NIT)",null,null,null,null,null,null,null,null,null,null,null,null,null,null,null,null,"País Expedición (NIT)"]
[]
[null,null,null,null,null,null,null,null,null,null,null,null,"Fecha de Nacimiento (PN)",null,null,null,null,null,null,null,null,null,null,null,null,null,null,null,"País de Nacimiento ",null,null,null,null,null,null,null,null,null,null,null,null,null,null,null,null,"País de Nacionalidad"]
[]
[null,"Dirección Residencia",null,null,null,null,null,null,null,null,null,null,null,null,null,null,null,null,null,"Departamento",null,null,null,null,null,null,null,null,null,null,null,null,null,null,"Municipio",null,null,null,null,null,null,null,null,null,"País de Residencia"]
[]
[null,null,null,null,null,null,null,null,null,null,null,null,null,null,null,null,null,null,null,"Código Postal",null,null,null,null,null,null,null,null,null,null,"Correo electrónico"]
[]
[null,"Beneficiario final de la estructura sin personería jurídica"]
[]
[null,"Fiduciante / Fideicomitente / Constituyente o posición similar o equivalente",null,null,null,null,null,null,null,null,null,null,null,null,null,null,"Comité financiero o posición similar o equivalente",null,null,null,null,null,null,null,null,null,null,null,null,"Fideicomisario / Beneficiario",null,null,null,null,null,null,null,null,null,null,"Ejerce control final y/o efectivo o tiene derecho a gozar y/o disponer de los activos, beneficios, resultados o utilidades"]
[]
[null,null,"Beneficiario Condicionado",null,null,null,null,null,null,null,{"$f":"+IF(AC1256=\"\",\"N\",\"S\")","v":"N"},null,null,null,null,"Condiciones que se deben cumplir para tener la calidad de beneficiario final - (Beneficiario Condicionado)"]
[]
[null,"Participación en el capital de la persona jurídica (%)",null,null,null,null,null,null,null,null,null,null,null,null,null,"Fecha desde la cual tiene la calidad de ben. final o existe la condición",null,null,null,null,null,null,null,null,null,null,null,null,null,null,null,null,null,"Fecha desde la cual deja de tener la calidad de ben. final o de existir la condición"]
[]
[null,{"$f":"+B1234+1","v":49},"Tipo Novedad"]
[null,{"$f":"+\"Beneficiario \"&B1260&\".\"","v":"Beneficiario 49."}]
[null,"Datos de los Beneficiarios Finales"]
[]
[null,"Nombre de la Empresa o Razón Social",null,null,null,null,null,null,null,null,null,null,null,null,null,null,null,null,null,null,null,null,null,null,null,null,null,null,null,null,null,null,null,null,null,null,null,null,null,null,null,null,null,null,null,null,null,null,"NIT - DV",null,null,null,null,null,null,null,null,null,null,"-"]
[]
[null,"Primer Nombre",null,null,null,null,null,null,null,null,null,null,null,null,"Otros Nombres",null,null,null,null,null,null,null,null,null,null,null,null,null,"Primer Apellido",null,null,null,null,null,null,null,null,null,null,null,null,null,null,null,null,"Segundo Apellido"]
[]
[null,"Tipo de Documento",null,null,null,null,null,null,null,null,null,null,null,null,"Número de identificación",null,null,null,null,null,null,null,null,null,null,null,null,null,"País de Expedición de Identificación"]
[]
[null,null,null,null,null,null,null,null,null,null,null,"Número de identificación Tributaria (NIT)",null,null,null,null,null,null,null,null,null,null,null,null,null,null,null,null,"País Expedición (NIT)"]
[]
[null,null,null,null,null,null,null,null,null,null,null,null,"Fecha de Nacimiento (PN)",null,null,null,null,null,null,null,null,null,null,null,null,null,null,null,"País de Nacimiento ",null,null,null,null,null,null,null,null,null,null,null,null,null,null,null,null,"País de Nacionalidad"]
[]
[null,"Dirección Residencia",null,null,null,null,null,null,null,null,null,null,null,null,null,null,null,null,null,"Departamento",null,null,null,null,null,null,null,null,null,null,null,null,null,null,"Municipio",null,null,null,null,null,null,null,null,null,"País de Residencia"]
[]
[null,null,null,null,null,null,null,null,null,null,null,null,null,null,null,null,null,null,null,"Código Postal",null,null,null,null,null,null,null,null,null,null,"Correo electrónico"]
[]
[null,"Beneficiario final de la estructura sin personería jurídica"]
[]
[null,"Fiduciante / Fideicomitente / Constituyente o posición similar o equivalente",null,null,null,null,null,null,null,null,null,null,null,null,null,null,"Comité financiero o posición similar o equivalente",null,null,null,null,null,null,null,null,null,null,null,null,"Fideicomisario / Beneficiario",null,null,null,null,null,null,null,null,null,null,"Ejerce control final y/o efectivo o tiene derecho a gozar y/o disponer de los activos, beneficios, resultados o utilidades"]
[]
[null,null,"Beneficiario Condicionado",null,null,null,null,null,null,null,{"$f":"+IF(AC1282=\"\",\"N\",\"S\")","v":"N"},null,null,null,null,"Condiciones que se deben cumplir para tener la calidad de beneficiario final - (Beneficiario Condicionado)"]
[]
[null,"Participación en el capital de la persona jurídica (%)",null,null,null,null,null,null,null,null,null,null,null,null,null,"Fecha desde la cual tiene la calidad de ben. final o existe la condición",null,null,null,null,null,null,null,null,null,null,null,null,null,null,null,null,null,"Fecha desde la cual deja de tener la calidad de ben. final o de existir la condición"]
[]
[null,{"$f":"+B1260+1","v":50},"Tipo Novedad"]
[null,{"$f":"+\"Beneficiario \"&B1286&\".\"","v":"Beneficiario 50."}]
[null,"Datos de los Beneficiarios Finales"]
[]
[null,"Nombre de la Empresa o Razón Social",null,null,null,null,null,null,null,null,null,null,null,null,null,null,null,null,null,null,null,null,null,null,null,null,null,null,null,null,null,null,null,null,null,null,null,null,null,null,null,null,null,null,null,null,null,null,"NIT - DV",null,null,null,null,null,null,null,null,null,null,"-"]
[]
[null,"Primer Nombre",null,null,null,null,null,null,null,null,null,null,null,null,"Otros Nombres",null,null,null,null,null,null,null,null,null,null,null,null,null,"Primer Apellido",null,null,null,null,null,null,null,null,null,null,null,null,null,null,null,null,"Segundo Apellido"]
[]
[null,"Tipo de Documento",null,null,null,null,null,null,null,null,null,null,null,null,"Número de identificación",null,null,null,null,null,null,null,null,null,null,null,null,null,"País de Expedición de Identificación"]
[]
[null,null,null,null,null,null,null,null,null,null,null,"Número de identificación Tributaria (NIT)",null,null,null,null,null,null,null,null,null,null,null,null,null,null,null,null,"País Expedición (NIT)"]
[]
[null,null,null,null,null,null,null,null,null,null,null,null,"Fecha de Nacimiento (PN)",null,null,null,null,null,null,null,null,null,null,null,null,null,null,null,"País de Nacimiento ",null,null,null,null,null,null,null,null,null,null,null,null,null,null,null,null,"País de Nacionalidad"]
[]
[null,"Dirección Residencia",null,null,null,null,null,null,null,null,null,null,null,null,null,null,null,null,null,"Departamento",null,null,null,null,null,null,null,null,null,null,null,null,null,null,"Municipio",null,null,null,null,null,null,null,null,null,"País de Residencia"]
[]
[null,null,null,null,null,null,null,null,null,null,null,null,null,null,null,null,null,null,null,"Código Postal",null,null,null,null,null,null,null,null,null,null,"Correo electrónico"]
[]
[null,"Beneficiario final de la estructura sin personería jurídica"]
[]
[null,"Fiduciante / Fideicomitente / Constituyente o posición similar o equivalente",null,null,null,null,null,null,null,null,null,null,null,null,null,null,"Comité financiero o posición similar o equivalente",null,null,null,null,null,null,null,null,null,null,null,null,"Fideicomisario / Beneficiario",null,null,null,null,null,null,null,null,null,null,"Ejerce control final y/o efectivo o tiene derecho a gozar y/o disponer de los activos, beneficios, resultados o utilidades"]
[]
[null,null,"Beneficiario Condicionado",null,null,null,null,null,null,null,{"$f":"+IF(AC1308=\"\",\"N\",\"S\")","v":"N"},null,null,null,null,"Condiciones que se deben cumplir para tener la calidad de beneficiario final - (Beneficiario Condicionado)"]
[]
[null,"Participación en el capital de la persona jurídica (%)",null,null,null,null,null,null,null,null,null,null,null,null,null,"Fecha desde la cual tiene la calidad de ben. final o existe la condición",null,null,null,null,null,null,null,null,null,null,null,null,null,null,null,null,null,"Fecha desde la cual deja de tener la calidad de ben. final o de existir la condición"]
[]
[null,{"$f":"+B1286+1","v":51},"Tipo Novedad"]
[null,{"$f":"+\"Beneficiario \"&B1312&\".\"","v":"Beneficiario 51."}]
[null,"Datos de los Beneficiarios Finales"]
[]
[null,"Nombre de la Empresa o Razón Social",null,null,null,null,null,null,null,null,null,null,null,null,null,null,null,null,null,null,null,null,null,null,null,null,null,null,null,null,null,null,null,null,null,null,null,null,null,null,null,null,null,null,null,null,null,null,"NIT - DV",null,null,null,null,null,null,null,null,null,null,"-"]
[]
[null,"Primer Nombre",null,null,null,null,null,null,null,null,null,null,null,null,"Otros Nombres",null,null,null,null,null,null,null,null,null,null,null,null,null,"Primer Apellido",null,null,null,null,null,null,null,null,null,null,null,null,null,null,null,null,"Segundo Apellido"]
[]
[null,"Tipo de Documento",null,null,null,null,null,null,null,null,null,null,null,null,"Número de identificación",null,null,null,null,null,null,null,null,null,null,null,null,null,"País de Expedición de Identificación"]
[]
[null,null,null,null,null,null,null,null,null,null,null,"Número de identificación Tributaria (NIT)",null,null,null,null,null,null,null,null,null,null,null,null,null,null,null,null,"País Expedición (NIT)"]
[]
[null,null,null,null,null,null,null,null,null,null,null,null,"Fecha de Nacimiento (PN)",null,null,null,null,null,null,null,null,null,null,null,null,null,null,null,"País de Nacimiento ",null,null,null,null,null,null,null,null,null,null,null,null,null,null,null,null,"País de Nacionalidad"]
[]
[null,"Dirección Residencia",null,null,null,null,null,null,null,null,null,null,null,null,null,null,null,null,null,"Departamento",null,null,null,null,null,null,null,null,null,null,null,null,null,null,"Municipio",null,null,null,null,null,null,null,null,null,"País de Residencia"]
[]
[null,null,null,null,null,null,null,null,null,null,null,null,null,null,null,null,null,null,null,"Código Postal",null,null,null,null,null,null,null,null,null,null,"Correo electrónico"]
[]
[null,"Beneficiario final de la estructura sin personería jurídica"]
[]
[null,"Fiduciante / Fideicomitente / Constituyente o posición similar o equivalente",null,null,null,null,null,null,null,null,null,null,null,null,null,null,"Comité financiero o posición similar o equivalente",null,null,null,null,null,null,null,null,null,null,null,null,"Fideicomisario / Beneficiario",null,null,null,null,null,null,null,null,null,null,"Ejerce control final y/o efectivo o tiene derecho a gozar y/o disponer de los activos, beneficios, resultados o utilidades"]
[]
[null,null,"Beneficiario Condicionado",null,null,null,null,null,null,null,{"$f":"+IF(AC1334=\"\",\"N\",\"S\")","v":"N"},null,null,null,null,"Condiciones que se deben cumplir para tener la calidad de beneficiario final - (Beneficiario Condicionado)"]
[]
[null,"Participación en el capital de la persona jurídica (%)",null,null,null,null,null,null,null,null,null,null,null,null,null,"Fecha desde la cual tiene la calidad de ben. final o existe la condición",null,null,null,null,null,null,null,null,null,null,null,null,null,null,null,null,null,"Fecha desde la cual deja de tener la calidad de ben. final o de existir la condición"]
[]
[null,{"$f":"+B1312+1","v":52},"Tipo Novedad"]
[null,{"$f":"+\"Beneficiario \"&B1338&\".\"","v":"Beneficiario 52."}]
[null,"Datos de los Beneficiarios Finales"]
[]
[null,"Nombre de la Empresa o Razón Social",null,null,null,null,null,null,null,null,null,null,null,null,null,null,null,null,null,null,null,null,null,null,null,null,null,null,null,null,null,null,null,null,null,null,null,null,null,null,null,null,null,null,null,null,null,null,"NIT - DV",null,null,null,null,null,null,null,null,null,null,"-"]
[]
[null,"Primer Nombre",null,null,null,null,null,null,null,null,null,null,null,null,"Otros Nombres",null,null,null,null,null,null,null,null,null,null,null,null,null,"Primer Apellido",null,null,null,null,null,null,null,null,null,null,null,null,null,null,null,null,"Segundo Apellido"]
[]
[null,"Tipo de Documento",null,null,null,null,null,null,null,null,null,null,null,null,"Número de identificación",null,null,null,null,null,null,null,null,null,null,null,null,null,"País de Expedición de Identificación"]
[]
[null,null,null,null,null,null,null,null,null,null,null,"Número de identificación Tributaria (NIT)",null,null,null,null,null,null,null,null,null,null,null,null,null,null,null,null,"País Expedición (NIT)"]
[]
[null,null,null,null,null,null,null,null,null,null,null,null,"Fecha de Nacimiento (PN)",null,null,null,null,null,null,null,null,null,null,null,null,null,null,null,"País de Nacimiento ",null,null,null,null,null,null,null,null,null,null,null,null,null,null,null,null,"País de Nacionalidad"]
[]
[null,"Dirección Residencia",null,null,null,null,null,null,null,null,null,null,null,null,null,null,null,null,null,"Departamento",null,null,null,null,null,null,null,null,null,null,null,null,null,null,"Municipio",null,null,null,null,null,null,null,null,null,"País de Residencia"]
[]
[null,null,null,null,null,null,null,null,null,null,null,null,null,null,null,null,null,null,null,"Código Postal",null,null,null,null,null,null,null,null,null,null,"Correo electrónico"]
[]
[null,"Beneficiario final de la estructura sin personería jurídica"]
[]
[null,"Fiduciante / Fideicomitente / Constituyente o posición similar o equivalente",null,null,null,null,null,null,null,null,null,null,null,null,null,null,"Comité financiero o posición similar o equivalente",null,null,null,null,null,null,null,null,null,null,null,null,"Fideicomisario / Beneficiario",null,null,null,null,null,null,null,null,null,null,"Ejerce control final y/o efectivo o tiene derecho a gozar y/o disponer de los activos, beneficios, resultados o utilidades"]
[]
[null,null,"Beneficiario Condicionado",null,null,null,null,null,null,null,{"$f":"+IF(AC1360=\"\",\"N\",\"S\")","v":"N"},null,null,null,null,"Condiciones que se deben cumplir para tener la calidad de beneficiario final - (Beneficiario Condicionado)"]
[]
[null,"Participación en el capital de la persona jurídica (%)",null,null,null,null,null,null,null,null,null,null,null,null,null,"Fecha desde la cual tiene la calidad de ben. final o existe la condición",null,null,null,null,null,null,null,null,null,null,null,null,null,null,null,null,null,"Fecha desde la cual deja de tener la calidad de ben. final o de existir la condición"]
[]
[null,{"$f":"+B1338+1","v":53},"Tipo Novedad"]
[null,{"$f":"+\"Beneficiario \"&B1364&\".\"","v":"Beneficiario 53."}]
[null,"Datos de los Beneficiarios Finales"]
[]
[null,"Nombre de la Empresa o Razón Social",null,null,null,null,null,null,null,null,null,null,null,null,null,null,null,null,null,null,null,null,null,null,null,null,null,null,null,null,null,null,null,null,null,null,null,null,null,null,null,null,null,null,null,null,null,null,"NIT - DV",null,null,null,null,null,null,null,null,null,null,"-"]
[]
[null,"Primer Nombre",null,null,null,null,null,null,null,null,null,null,null,null,"Otros Nombres",null,null,null,null,null,null,null,null,null,null,null,null,null,"Primer Apellido",null,null,null,null,null,null,null,null,null,null,null,null,null,null,null,null,"Segundo Apellido"]
[]
[null,"Tipo de Documento",null,null,null,null,null,null,null,null,null,null,null,null,"Número de identificación",null,null,null,null,null,null,null,null,null,null,null,null,null,"País de Expedición de Identificación"]
[]
[null,null,null,null,null,null,null,null,null,null,null,"Número de identificación Tributaria (NIT)",null,null,null,null,null,null,null,null,null,null,null,null,null,null,null,null,"País Expedición (NIT)"]
[]
[null,null,null,null,null,null,null,null,null,null,null,null,"Fecha de Nacimiento (PN)",null,null,null,null,null,null,null,null,null,null,null,null,null,null,null,"País de Nacimiento ",null,null,null,null,null,null,null,null,null,null,null,null,null,null,null,null,"País de Nacionalidad"]
[]
[null,"Dirección Residencia",null,null,null,null,null,null,null,null,null,null,null,null,null,null,null,null,null,"Departamento",null,null,null,null,null,null,null,null,null,null,null,null,null,null,"Municipio",null,null,null,null,null,null,null,null,null,"País de Residencia"]
[]
[null,null,null,null,null,null,null,null,null,null,null,null,null,null,null,null,null,null,null,"Código Postal",null,null,null,null,null,null,null,null,null,null,"Correo electrónico"]
[]
[null,"Beneficiario final de la estructura sin personería jurídica"]
[]
[null,"Fiduciante / Fideicomitente / Constituyente o posición similar o equivalente",null,null,null,null,null,null,null,null,null,null,null,null,null,null,"Comité financiero o posición similar o equivalente",null,null,null,null,null,null,null,null,null,null,null,null,"Fideicomisario / Beneficiario",null,null,null,null,null,null,null,null,null,null,"Ejerce control final y/o efectivo o tiene derecho a gozar y/o disponer de los activos, beneficios, resultados o utilidades"]
[]
[null,null,"Beneficiario Condicionado",null,null,null,null,null,null,null,{"$f":"+IF(AC1386=\"\",\"N\",\"S\")","v":"N"},null,null,null,null,"Condiciones que se deben cumplir para tener la calidad de beneficiario final - (Beneficiario Condicionado)"]
[]
[null,"Participación en el capital de la persona jurídica (%)",null,null,null,null,null,null,null,null,null,null,null,null,null,"Fecha desde la cual tiene la calidad de ben. final o existe la condición",null,null,null,null,null,null,null,null,null,null,null,null,null,null,null,null,null,"Fecha desde la cual deja de tener la calidad de ben. final o de existir la condición"]
[]
[null,{"$f":"+B1364+1","v":54},"Tipo Novedad"]
[null,{"$f":"+\"Beneficiario \"&B1390&\".\"","v":"Beneficiario 54."}]
[null,"Datos de los Beneficiarios Finales"]
[]
[null,"Nombre de la Empresa o Razón Social",null,null,null,null,null,null,null,null,null,null,null,null,null,null,null,null,null,null,null,null,null,null,null,null,null,null,null,null,null,null,null,null,null,null,null,null,null,null,null,null,null,null,null,null,null,null,"NIT - DV",null,null,null,null,null,null,null,null,null,null,"-"]
[]
[null,"Primer Nombre",null,null,null,null,null,null,null,null,null,null,null,null,"Otros Nombres",null,null,null,null,null,null,null,null,null,null,null,null,null,"Primer Apellido",null,null,null,null,null,null,null,null,null,null,null,null,null,null,null,null,"Segundo Apellido"]
[]
[null,"Tipo de Documento",null,null,null,null,null,null,null,null,null,null,null,null,"Número de identificación",null,null,null,null,null,null,null,null,null,null,null,null,null,"País de Expedición de Identificación"]
[]
[null,null,null,null,null,null,null,null,null,null,null,"Número de identificación Tributaria (NIT)",null,null,null,null,null,null,null,null,null,null,null,null,null,null,null,null,"País Expedición (NIT)"]
[]
[null,null,null,null,null,null,null,null,null,null,null,null,"Fecha de Nacimiento (PN)",null,null,null,null,null,null,null,null,null,null,null,null,null,null,null,"País de Nacimiento ",null,null,null,null,null,null,null,null,null,null,null,null,null,null,null,null,"País de Nacionalidad"]
[]
[null,"Dirección Residencia",null,null,null,null,null,null,null,null,null,null,null,null,null,null,null,null,null,"Departamento",null,null,null,null,null,null,null,null,null,null,null,null,null,null,"Municipio",null,null,null,null,null,null,null,null,null,"País de Residencia"]
[]
[null,null,null,null,null,null,null,null,null,null,null,null,null,null,null,null,null,null,null,"Código Postal",null,null,null,null,null,null,null,null,null,null,"Correo electrónico"]
[]
[null,"Beneficiario final de la estructura sin personería jurídica"]
[]
[null,"Fiduciante / Fideicomitente / Constituyente o posición similar o equivalente",null,null,null,null,null,null,null,null,null,null,null,null,null,null,"Comité financiero o posición similar o equivalente",null,null,null,null,null,null,null,null,null,null,null,null,"Fideicomisario / Beneficiario",null,null,null,null,null,null,null,null,null,null,"Ejerce control final y/o efectivo o tiene derecho a gozar y/o disponer de los activos, beneficios, resultados o utilidades"]
[]
[null,null,"Beneficiario Condicionado",null,null,null,null,null,null,null,{"$f":"+IF(AC1412=\"\",\"N\",\"S\")","v":"N"},null,null,null,null,"Condiciones que se deben cumplir para tener la calidad de beneficiario final - (Beneficiario Condicionado)"]
[]
[null,"Participación en el capital de la persona jurídica (%)",null,null,null,null,null,null,null,null,null,null,null,null,null,"Fecha desde la cual tiene la calidad de ben. final o existe la condición",null,null,null,null,null,null,null,null,null,null,null,null,null,null,null,null,null,"Fecha desde la cual deja de tener la calidad de ben. final o de existir la condición"]
[]
[null,{"$f":"+B1390+1","v":55},"Tipo Novedad"]
[null,{"$f":"+\"Beneficiario \"&B1416&\".\"","v":"Beneficiario 55."}]
[null,"Datos de los Beneficiarios Finales"]
[]
[null,"Nombre de la Empresa o Razón Social",null,null,null,null,null,null,null,null,null,null,null,null,null,null,null,null,null,null,null,null,null,null,null,null,null,null,null,null,null,null,null,null,null,null,null,null,null,null,null,null,null,null,null,null,null,null,"NIT - DV",null,null,null,null,null,null,null,null,null,null,"-"]
[]
[null,"Primer Nombre",null,null,null,null,null,null,null,null,null,null,null,null,"Otros Nombres",null,null,null,null,null,null,null,null,null,null,null,null,null,"Primer Apellido",null,null,null,null,null,null,null,null,null,null,null,null,null,null,null,null,"Segundo Apellido"]
[]
[null,"Tipo de Documento",null,null,null,null,null,null,null,null,null,null,null,null,"Número de identificación",null,null,null,null,null,null,null,null,null,null,null,null,null,"País de Expedición de Identificación"]
[]
[null,null,null,null,null,null,null,null,null,null,null,"Número de identificación Tributaria (NIT)",null,null,null,null,null,null,null,null,null,null,null,null,null,null,null,null,"País Expedición (NIT)"]
[]
[null,null,null,null,null,null,null,null,null,null,null,null,"Fecha de Nacimiento (PN)",null,null,null,null,null,null,null,null,null,null,null,null,null,null,null,"País de Nacimiento ",null,null,null,null,null,null,null,null,null,null,null,null,null,null,null,null,"País de Nacionalidad"]
[]
[null,"Dirección Residencia",null,null,null,null,null,null,null,null,null,null,null,null,null,null,null,null,null,"Departamento",null,null,null,null,null,null,null,null,null,null,null,null,null,null,"Municipio",null,null,null,null,null,null,null,null,null,"País de Residencia"]
[]
[null,null,null,null,null,null,null,null,null,null,null,null,null,null,null,null,null,null,null,"Código Postal",null,null,null,null,null,null,null,null,null,null,"Correo electrónico"]
[]
[null,"Beneficiario final de la estructura sin personería jurídica"]
[]
[null,"Fiduciante / Fideicomitente / Constituyente o posición similar o equivalente",null,null,null,null,null,null,null,null,null,null,null,null,null,null,"Comité financiero o posición similar o equivalente",null,null,null,null,null,null,null,null,null,null,null,null,"Fideicomisario / Beneficiario",null,null,null,null,null,null,null,null,null,null,"Ejerce control final y/o efectivo o tiene derecho a gozar y/o disponer de los activos, beneficios, resultados o utilidades"]
[]
[null,null,"Beneficiario Condicionado",null,null,null,null,null,null,null,{"$f":"+IF(AC1438=\"\",\"N\",\"S\")","v":"N"},null,null,null,null,"Condiciones que se deben cumplir para tener la calidad de beneficiario final - (Beneficiario Condicionado)"]
[]
[null,"Participación en el capital de la persona jurídica (%)",null,null,null,null,null,null,null,null,null,null,null,null,null,"Fecha desde la cual tiene la calidad de ben. final o existe la condición",null,null,null,null,null,null,null,null,null,null,null,null,null,null,null,null,null,"Fecha desde la cual deja de tener la calidad de ben. final o de existir la condición"]
[]
[null,{"$f":"+B1416+1","v":56},"Tipo Novedad"]
[null,{"$f":"+\"Beneficiario \"&B1442&\".\"","v":"Beneficiario 56."}]
[null,"Datos de los Beneficiarios Finales"]
[]
[null,"Nombre de la Empresa o Razón Social",null,null,null,null,null,null,null,null,null,null,null,null,null,null,null,null,null,null,null,null,null,null,null,null,null,null,null,null,null,null,null,null,null,null,null,null,null,null,null,null,null,null,null,null,null,null,"NIT - DV",null,null,null,null,null,null,null,null,null,null,"-"]
[]
[null,"Primer Nombre",null,null,null,null,null,null,null,null,null,null,null,null,"Otros Nombres",null,null,null,null,null,null,null,null,null,null,null,null,null,"Primer Apellido",null,null,null,null,null,null,null,null,null,null,null,null,null,null,null,null,"Segundo Apellido"]
[]
[null,"Tipo de Documento",null,null,null,null,null,null,null,null,null,null,null,null,"Número de identificación",null,null,null,null,null,null,null,null,null,null,null,null,null,"País de Expedición de Identificación"]
[]
[null,null,null,null,null,null,null,null,null,null,null,"Número de identificación Tributaria (NIT)",null,null,null,null,null,null,null,null,null,null,null,null,null,null,null,null,"País Expedición (NIT)"]
[]
[null,null,null,null,null,null,null,null,null,null,null,null,"Fecha de Nacimiento (PN)",null,null,null,null,null,null,null,null,null,null,null,null,null,null,null,"País de Nacimiento ",null,null,null,null,null,null,null,null,null,null,null,null,null,null,null,null,"País de Nacionalidad"]
[]
[null,"Dirección Residencia",null,null,null,null,null,null,null,null,null,null,null,null,null,null,null,null,null,"Departamento",null,null,null,null,null,null,null,null,null,null,null,null,null,null,"Municipio",null,null,null,null,null,null,null,null,null,"País de Residencia"]
[]
[null,null,null,null,null,null,null,null,null,null,null,null,null,null,null,null,null,null,null,"Código Postal",null,null,null,null,null,null,null,null,null,null,"Correo electrónico"]
[]
[null,"Beneficiario final de la estructura sin personería jurídica"]
[]
[null,"Fiduciante / Fideicomitente / Constituyente o posición similar o equivalente",null,null,null,null,null,null,null,null,null,null,null,null,null,null,"Comité financiero o posición similar o equivalente",null,null,null,null,null,null,null,null,null,null,null,null,"Fideicomisario / Beneficiario",null,null,null,null,null,null,null,null,null,null,"Ejerce control final y/o efectivo o tiene derecho a gozar y/o disponer de los activos, beneficios, resultados o utilidades"]
[]
[null,null,"Beneficiario Condicionado",null,null,null,null,null,null,null,{"$f":"+IF(AC1464=\"\",\"N\",\"S\")","v":"N"},null,null,null,null,"Condiciones que se deben cumplir para tener la calidad de beneficiario final - (Beneficiario Condicionado)"]
[]
[null,"Participación en el capital de la persona jurídica (%)",null,null,null,null,null,null,null,null,null,null,null,null,null,"Fecha desde la cual tiene la calidad de ben. final o existe la condición",null,null,null,null,null,null,null,null,null,null,null,null,null,null,null,null,null,"Fecha desde la cual deja de tener la calidad de ben. final o de existir la condición"]
[]
[null,{"$f":"+B1442+1","v":57},"Tipo Novedad"]
[null,{"$f":"+\"Beneficiario \"&B1468&\".\"","v":"Beneficiario 57."}]
[null,"Datos de los Beneficiarios Finales"]
[]
[null,"Nombre de la Empresa o Razón Social",null,null,null,null,null,null,null,null,null,null,null,null,null,null,null,null,null,null,null,null,null,null,null,null,null,null,null,null,null,null,null,null,null,null,null,null,null,null,null,null,null,null,null,null,null,null,"NIT - DV",null,null,null,null,null,null,null,null,null,null,"-"]
[]
[null,"Primer Nombre",null,null,null,null,null,null,null,null,null,null,null,null,"Otros Nombres",null,null,null,null,null,null,null,null,null,null,null,null,null,"Primer Apellido",null,null,null,null,null,null,null,null,null,null,null,null,null,null,null,null,"Segundo Apellido"]
[]
[null,"Tipo de Documento",null,null,null,null,null,null,null,null,null,null,null,null,"Número de identificación",null,null,null,null,null,null,null,null,null,null,null,null,null,"País de Expedición de Identificación"]
[]
[null,null,null,null,null,null,null,null,null,null,null,"Número de identificación Tributaria (NIT)",null,null,null,null,null,null,null,null,null,null,null,null,null,null,null,null,"País Expedición (NIT)"]
[]
[null,null,null,null,null,null,null,null,null,null,null,null,"Fecha de Nacimiento (PN)",null,null,null,null,null,null,null,null,null,null,null,null,null,null,null,"País de Nacimiento ",null,null,null,null,null,null,null,null,null,null,null,null,null,null,null,null,"País de Nacionalidad"]
[]
[null,"Dirección Residencia",null,null,null,null,null,null,null,null,null,null,null,null,null,null,null,null,null,"Departamento",null,null,null,null,null,null,null,null,null,null,null,null,null,null,"Municipio",null,null,null,null,null,null,null,null,null,"País de Residencia"]
[]
[null,null,null,null,null,null,null,null,null,null,null,null,null,null,null,null,null,null,null,"Código Postal",null,null,null,null,null,null,null,null,null,null,"Correo electrónico"]
[]
[null,"Beneficiario final de la estructura sin personería jurídica"]
[]
[null,"Fiduciante / Fideicomitente / Constituyente o posición similar o equivalente",null,null,null,null,null,null,null,null,null,null,null,null,null,null,"Comité financiero o posición similar o equivalente",null,null,null,null,null,null,null,null,null,null,null,null,"Fideicomisario / Beneficiario",null,null,null,null,null,null,null,null,null,null,"Ejerce control final y/o efectivo o tiene derecho a gozar y/o disponer de los activos, beneficios, resultados o utilidades"]
[]
[null,null,"Beneficiario Condicionado",null,null,null,null,null,null,null,{"$f":"+IF(AC1490=\"\",\"N\",\"S\")","v":"N"},null,null,null,null,"Condiciones que se deben cumplir para tener la calidad de beneficiario final - (Beneficiario Condicionado)"]
[]
[null,"Participación en el capital de la persona jurídica (%)",null,null,null,null,null,null,null,null,null,null,null,null,null,"Fecha desde la cual tiene la calidad de ben. final o existe la condición",null,null,null,null,null,null,null,null,null,null,null,null,null,null,null,null,null,"Fecha desde la cual deja de tener la calidad de ben. final o de existir la condición"]
[]
[null,{"$f":"+B1468+1","v":58},"Tipo Novedad"]
[null,{"$f":"+\"Beneficiario \"&B1494&\".\"","v":"Beneficiario 58."}]
[null,"Datos de los Beneficiarios Finales"]
[]
[null,"Nombre de la Empresa o Razón Social",null,null,null,null,null,null,null,null,null,null,null,null,null,null,null,null,null,null,null,null,null,null,null,null,null,null,null,null,null,null,null,null,null,null,null,null,null,null,null,null,null,null,null,null,null,null,"NIT - DV",null,null,null,null,null,null,null,null,null,null,"-"]
[]
[null,"Primer Nombre",null,null,null,null,null,null,null,null,null,null,null,null,"Otros Nombres",null,null,null,null,null,null,null,null,null,null,null,null,null,"Primer Apellido",null,null,null,null,null,null,null,null,null,null,null,null,null,null,null,null,"Segundo Apellido"]
[]
[null,"Tipo de Documento",null,null,null,null,null,null,null,null,null,null,null,null,"Número de identificación",null,null,null,null,null,null,null,null,null,null,null,null,null,"País de Expedición de Identificación"]
[]
[null,null,null,null,null,null,null,null,null,null,null,"Número de identificación Tributaria (NIT)",null,null,null,null,null,null,null,null,null,null,null,null,null,null,null,null,"País Expedición (NIT)"]
[]
[null,null,null,null,null,null,null,null,null,null,null,null,"Fecha de Nacimiento (PN)",null,null,null,null,null,null,null,null,null,null,null,null,null,null,null,"País de Nacimiento ",null,null,null,null,null,null,null,null,null,null,null,null,null,null,null,null,"País de Nacionalidad"]
[]
[null,"Dirección Residencia",null,null,null,null,null,null,null,null,null,null,null,null,null,null,null,null,null,"Departamento",null,null,null,null,null,null,null,null,null,null,null,null,null,null,"Municipio",null,null,null,null,null,null,null,null,null,"País de Residencia"]
[]
[null,null,null,null,null,null,null,null,null,null,null,null,null,null,null,null,null,null,null,"Código Postal",null,null,null,null,null,null,null,null,null,null,"Correo electrónico"]
[]
[null,"Beneficiario final de la estructura sin personería jurídica"]
[]
[null,"Fiduciante / Fideicomitente / Constituyente o posición similar o equivalente",null,null,null,null,null,null,null,null,null,null,null,null,null,null,"Comité financiero o posición similar o equivalente",null,null,null,null,null,null,null,null,null,null,null,null,"Fideicomisario / Beneficiario",null,null,null,null,null,null,null,null,null,null,"Ejerce control final y/o efectivo o tiene derecho a gozar y/o disponer de los activos, beneficios, resultados o utilidades"]
[]
[null,null,"Beneficiario Condicionado",null,null,null,null,null,null,null,{"$f":"+IF(AC1516=\"\",\"N\",\"S\")","v":"N"},null,null,null,null,"Condiciones que se deben cumplir para tener la calidad de beneficiario final - (Beneficiario Condicionado)"]
[]
[null,"Participación en el capital de la persona jurídica (%)",null,null,null,null,null,null,null,null,null,null,null,null,null,"Fecha desde la cual tiene la calidad de ben. final o existe la condición",null,null,null,null,null,null,null,null,null,null,null,null,null,null,null,null,null,"Fecha desde la cual deja de tener la calidad de ben. final o de existir la condición"]
[]
[null,{"$f":"+B1494+1","v":59},"Tipo Novedad"]
[null,{"$f":"+\"Beneficiario \"&B1520&\".\"","v":"Beneficiario 59."}]
[null,"Datos de los Beneficiarios Finales"]
[]
[null,"Nombre de la Empresa o Razón Social",null,null,null,null,null,null,null,null,null,null,null,null,null,null,null,null,null,null,null,null,null,null,null,null,null,null,null,null,null,null,null,null,null,null,null,null,null,null,null,null,null,null,null,null,null,null,"NIT - DV",null,null,null,null,null,null,null,null,null,null,"-"]
[]
[null,"Primer Nombre",null,null,null,null,null,null,null,null,null,null,null,null,"Otros Nombres",null,null,null,null,null,null,null,null,null,null,null,null,null,"Primer Apellido",null,null,null,null,null,null,null,null,null,null,null,null,null,null,null,null,"Segundo Apellido"]
[]
[null,"Tipo de Documento",null,null,null,null,null,null,null,null,null,null,null,null,"Número de identificación",null,null,null,null,null,null,null,null,null,null,null,null,null,"País de Expedición de Identificación"]
[]
[null,null,null,null,null,null,null,null,null,null,null,"Número de identificación Tributaria (NIT)",null,null,null,null,null,null,null,null,null,null,null,null,null,null,null,null,"País Expedición (NIT)"]
[]
[null,null,null,null,null,null,null,null,null,null,null,null,"Fecha de Nacimiento (PN)",null,null,null,null,null,null,null,null,null,null,null,null,null,null,null,"País de Nacimiento ",null,null,null,null,null,null,null,null,null,null,null,null,null,null,null,null,"País de Nacionalidad"]
[]
[null,"Dirección Residencia",null,null,null,null,null,null,null,null,null,null,null,null,null,null,null,null,null,"Departamento",null,null,null,null,null,null,null,null,null,null,null,null,null,null,"Municipio",null,null,null,null,null,null,null,null,null,"País de Residencia"]
[]
[null,null,null,null,null,null,null,null,null,null,null,null,null,null,null,null,null,null,null,"Código Postal",null,null,null,null,null,null,null,null,null,null,"Correo electrónico"]
[]
[null,"Beneficiario final de la estructura sin personería jurídica"]
[]
[null,"Fiduciante / Fideicomitente / Constituyente o posición similar o equivalente",null,null,null,null,null,null,null,null,null,null,null,null,null,null,"Comité financiero o posición similar o equivalente",null,null,null,null,null,null,null,null,null,null,null,null,"Fideicomisario / Beneficiario",null,null,null,null,null,null,null,null,null,null,"Ejerce control final y/o efectivo o tiene derecho a gozar y/o disponer de los activos, beneficios, resultados o utilidades"]
[]
[null,null,"Beneficiario Condicionado",null,null,null,null,null,null,null,{"$f":"+IF(AC1542=\"\",\"N\",\"S\")","v":"N"},null,null,null,null,"Condiciones que se deben cumplir para tener la calidad de beneficiario final - (Beneficiario Condicionado)"]
[]
[null,"Participación en el capital de la persona jurídica (%)",null,null,null,null,null,null,null,null,null,null,null,null,null,"Fecha desde la cual tiene la calidad de ben. final o existe la condición",null,null,null,null,null,null,null,null,null,null,null,null,null,null,null,null,null,"Fecha desde la cual deja de tener la calidad de ben. final o de existir la condición"]
[]
[null,{"$f":"+B1520+1","v":60},"Tipo Novedad"]
[null,{"$f":"+\"Beneficiario \"&B1546&\".\"","v":"Beneficiario 60."}]
[null,"Datos de los Beneficiarios Finales"]
[]
[null,"Nombre de la Empresa o Razón Social",null,null,null,null,null,null,null,null,null,null,null,null,null,null,null,null,null,null,null,null,null,null,null,null,null,null,null,null,null,null,null,null,null,null,null,null,null,null,null,null,null,null,null,null,null,null,"NIT - DV",null,null,null,null,null,null,null,null,null,null,"-"]
[]
[null,"Primer Nombre",null,null,null,null,null,null,null,null,null,null,null,null,"Otros Nombres",null,null,null,null,null,null,null,null,null,null,null,null,null,"Primer Apellido",null,null,null,null,null,null,null,null,null,null,null,null,null,null,null,null,"Segundo Apellido"]
[]
[null,"Tipo de Documento",null,null,null,null,null,null,null,null,null,null,null,null,"Número de identificación",null,null,null,null,null,null,null,null,null,null,null,null,null,"País de Expedición de Identificación"]
[]
[null,null,null,null,null,null,null,null,null,null,null,"Número de identificación Tributaria (NIT)",null,null,null,null,null,null,null,null,null,null,null,null,null,null,null,null,"País Expedición (NIT)"]
[]
[null,null,null,null,null,null,null,null,null,null,null,null,"Fecha de Nacimiento (PN)",null,null,null,null,null,null,null,null,null,null,null,null,null,null,null,"País de Nacimiento ",null,null,null,null,null,null,null,null,null,null,null,null,null,null,null,null,"País de Nacionalidad"]
[]
[null,"Dirección Residencia",null,null,null,null,null,null,null,null,null,null,null,null,null,null,null,null,null,"Departamento",null,null,null,null,null,null,null,null,null,null,null,null,null,null,"Municipio",null,null,null,null,null,null,null,null,null,"País de Residencia"]
[]
[null,null,null,null,null,null,null,null,null,null,null,null,null,null,null,null,null,null,null,"Código Postal",null,null,null,null,null,null,null,null,null,null,"Correo electrónico"]
[]
[null,"Beneficiario final de la estructura sin personería jurídica"]
[]
[null,"Fiduciante / Fideicomitente / Constituyente o posición similar o equivalente",null,null,null,null,null,null,null,null,null,null,null,null,null,null,"Comité financiero o posición similar o equivalente",null,null,null,null,null,null,null,null,null,null,null,null,"Fideicomisario / Beneficiario",null,null,null,null,null,null,null,null,null,null,"Ejerce control final y/o efectivo o tiene derecho a gozar y/o disponer de los activos, beneficios, resultados o utilidades"]
[]
[null,null,"Beneficiario Condicionado",null,null,null,null,null,null,null,{"$f":"+IF(AC1568=\"\",\"N\",\"S\")","v":"N"},null,null,null,null,"Condiciones que se deben cumplir para tener la calidad de beneficiario final - (Beneficiario Condicionado)"]
[]
[null,"Participación en el capital de la persona jurídica (%)",null,null,null,null,null,null,null,null,null,null,null,null,null,"Fecha desde la cual tiene la calidad de ben. final o existe la condición",null,null,null,null,null,null,null,null,null,null,null,null,null,null,null,null,null,"Fecha desde la cual deja de tener la calidad de ben. final o de existir la condición"]
[]
[null,{"$f":"+B1546+1","v":61},"Tipo Novedad"]
[null,{"$f":"+\"Beneficiario \"&B1572&\".\"","v":"Beneficiario 61."}]
[null,"Datos de los Beneficiarios Finales"]
[]
[null,"Nombre de la Empresa o Razón Social",null,null,null,null,null,null,null,null,null,null,null,null,null,null,null,null,null,null,null,null,null,null,null,null,null,null,null,null,null,null,null,null,null,null,null,null,null,null,null,null,null,null,null,null,null,null,"NIT - DV",null,null,null,null,null,null,null,null,null,null,"-"]
[]
[null,"Primer Nombre",null,null,null,null,null,null,null,null,null,null,null,null,"Otros Nombres",null,null,null,null,null,null,null,null,null,null,null,null,null,"Primer Apellido",null,null,null,null,null,null,null,null,null,null,null,null,null,null,null,null,"Segundo Apellido"]
[]
[null,"Tipo de Documento",null,null,null,null,null,null,null,null,null,null,null,null,"Número de identificación",null,null,null,null,null,null,null,null,null,null,null,null,null,"País de Expedición de Identificación"]
[]
[null,null,null,null,null,null,null,null,null,null,null,"Número de identificación Tributaria (NIT)",null,null,null,null,null,null,null,null,null,null,null,null,null,null,null,null,"País Expedición (NIT)"]
[]
[null,null,null,null,null,null,null,null,null,null,null,null,"Fecha de Nacimiento (PN)",null,null,null,null,null,null,null,null,null,null,null,null,null,null,null,"País de Nacimiento ",null,null,null,null,null,null,null,null,null,null,null,null,null,null,null,null,"País de Nacionalidad"]
[]
[null,"Dirección Residencia",null,null,null,null,null,null,null,null,null,null,null,null,null,null,null,null,null,"Departamento",null,null,null,null,null,null,null,null,null,null,null,null,null,null,"Municipio",null,null,null,null,null,null,null,null,null,"País de Residencia"]
[]
[null,null,null,null,null,null,null,null,null,null,null,null,null,null,null,null,null,null,null,"Código Postal",null,null,null,null,null,null,null,null,null,null,"Correo electrónico"]
[]
[null,"Beneficiario final de la estructura sin personería jurídica"]
[]
[null,"Fiduciante / Fideicomitente / Constituyente o posición similar o equivalente",null,null,null,null,null,null,null,null,null,null,null,null,null,null,"Comité financiero o posición similar o equivalente",null,null,null,null,null,null,null,null,null,null,null,null,"Fideicomisario / Beneficiario",null,null,null,null,null,null,null,null,null,null,"Ejerce control final y/o efectivo o tiene derecho a gozar y/o disponer de los activos, beneficios, resultados o utilidades"]
[]
[null,null,"Beneficiario Condicionado",null,null,null,null,null,null,null,{"$f":"+IF(AC1594=\"\",\"N\",\"S\")","v":"N"},null,null,null,null,"Condiciones que se deben cumplir para tener la calidad de beneficiario final - (Beneficiario Condicionado)"]
[]
[null,"Participación en el capital de la persona jurídica (%)",null,null,null,null,null,null,null,null,null,null,null,null,null,"Fecha desde la cual tiene la calidad de ben. final o existe la condición",null,null,null,null,null,null,null,null,null,null,null,null,null,null,null,null,null,"Fecha desde la cual deja de tener la calidad de ben. final o de existir la condición"]
[]
[null,{"$f":"+B1572+1","v":62},"Tipo Novedad"]
[null,{"$f":"+\"Beneficiario \"&B1598&\".\"","v":"Beneficiario 62."}]
[null,"Datos de los Beneficiarios Finales"]
[]
[null,"Nombre de la Empresa o Razón Social",null,null,null,null,null,null,null,null,null,null,null,null,null,null,null,null,null,null,null,null,null,null,null,null,null,null,null,null,null,null,null,null,null,null,null,null,null,null,null,null,null,null,null,null,null,null,"NIT - DV",null,null,null,null,null,null,null,null,null,null,"-"]
[]
[null,"Primer Nombre",null,null,null,null,null,null,null,null,null,null,null,null,"Otros Nombres",null,null,null,null,null,null,null,null,null,null,null,null,null,"Primer Apellido",null,null,null,null,null,null,null,null,null,null,null,null,null,null,null,null,"Segundo Apellido"]
[]
[null,"Tipo de Documento",null,null,null,null,null,null,null,null,null,null,null,null,"Número de identificación",null,null,null,null,null,null,null,null,null,null,null,null,null,"País de Expedición de Identificación"]
[]
[null,null,null,null,null,null,null,null,null,null,null,"Número de identificación Tributaria (NIT)",null,null,null,null,null,null,null,null,null,null,null,null,null,null,null,null,"País Expedición (NIT)"]
[]
[null,null,null,null,null,null,null,null,null,null,null,null,"Fecha de Nacimiento (PN)",null,null,null,null,null,null,null,null,null,null,null,null,null,null,null,"País de Nacimiento ",null,null,null,null,null,null,null,null,null,null,null,null,null,null,null,null,"País de Nacionalidad"]
[]
[null,"Dirección Residencia",null,null,null,null,null,null,null,null,null,null,null,null,null,null,null,null,null,"Departamento",null,null,null,null,null,null,null,null,null,null,null,null,null,null,"Municipio",null,null,null,null,null,null,null,null,null,"País de Residencia"]
[]
[null,null,null,null,null,null,null,null,null,null,null,null,null,null,null,null,null,null,null,"Código Postal",null,null,null,null,null,null,null,null,null,null,"Correo electrónico"]
[]
[null,"Beneficiario final de la estructura sin personería jurídica"]
[]
[null,"Fiduciante / Fideicomitente / Constituyente o posición similar o equivalente",null,null,null,null,null,null,null,null,null,null,null,null,null,null,"Comité financiero o posición similar o equivalente",null,null,null,null,null,null,null,null,null,null,null,null,"Fideicomisario / Beneficiario",null,null,null,null,null,null,null,null,null,null,"Ejerce control final y/o efectivo o tiene derecho a gozar y/o disponer de los activos, beneficios, resultados o utilidades"]
[]
[null,null,"Beneficiario Condicionado",null,null,null,null,null,null,null,{"$f":"+IF(AC1620=\"\",\"N\",\"S\")","v":"N"},null,null,null,null,"Condiciones que se deben cumplir para tener la calidad de beneficiario final - (Beneficiario Condicionado)"]
[]
[null,"Participación en el capital de la persona jurídica (%)",null,null,null,null,null,null,null,null,null,null,null,null,null,"Fecha desde la cual tiene la calidad de ben. final o existe la condición",null,null,null,null,null,null,null,null,null,null,null,null,null,null,null,null,null,"Fecha desde la cual deja de tener la calidad de ben. final o de existir la condición"]
[]
[null,{"$f":"+B1598+1","v":63},"Tipo Novedad"]
[null,{"$f":"+\"Beneficiario \"&B1624&\".\"","v":"Beneficiario 63."}]
[null,"Datos de los Beneficiarios Finales"]
[]
[null,"Nombre de la Empresa o Razón Social",null,null,null,null,null,null,null,null,null,null,null,null,null,null,null,null,null,null,null,null,null,null,null,null,null,null,null,null,null,null,null,null,null,null,null,null,null,null,null,null,null,null,null,null,null,null,"NIT - DV",null,null,null,null,null,null,null,null,null,null,"-"]
[]
[null,"Primer Nombre",null,null,null,null,null,null,null,null,null,null,null,null,"Otros Nombres",null,null,null,null,null,null,null,null,null,null,null,null,null,"Primer Apellido",null,null,null,null,null,null,null,null,null,null,null,null,null,null,null,null,"Segundo Apellido"]
[]
[null,"Tipo de Documento",null,null,null,null,null,null,null,null,null,null,null,null,"Número de identificación",null,null,null,null,null,null,null,null,null,null,null,null,null,"País de Expedición de Identificación"]
[]
[null,null,null,null,null,null,null,null,null,null,null,"Número de identificación Tributaria (NIT)",null,null,null,null,null,null,null,null,null,null,null,null,null,null,null,null,"País Expedición (NIT)"]
[]
[null,null,null,null,null,null,null,null,null,null,null,null,"Fecha de Nacimiento (PN)",null,null,null,null,null,null,null,null,null,null,null,null,null,null,null,"País de Nacimiento ",null,null,null,null,null,null,null,null,null,null,null,null,null,null,null,null,"País de Nacionalidad"]
[]
[null,"Dirección Residencia",null,null,null,null,null,null,null,null,null,null,null,null,null,null,null,null,null,"Departamento",null,null,null,null,null,null,null,null,null,null,null,null,null,null,"Municipio",null,null,null,null,null,null,null,null,null,"País de Residencia"]
[]
[null,null,null,null,null,null,null,null,null,null,null,null,null,null,null,null,null,null,null,"Código Postal",null,null,null,null,null,null,null,null,null,null,"Correo electrónico"]
[]
[null,"Beneficiario final de la estructura sin personería jurídica"]
[]
[null,"Fiduciante / Fideicomitente / Constituyente o posición similar o equivalente",null,null,null,null,null,null,null,null,null,null,null,null,null,null,"Comité financiero o posición similar o equivalente",null,null,null,null,null,null,null,null,null,null,null,null,"Fideicomisario / Beneficiario",null,null,null,null,null,null,null,null,null,null,"Ejerce control final y/o efectivo o tiene derecho a gozar y/o disponer de los activos, beneficios, resultados o utilidades"]
[]
[null,null,"Beneficiario Condicionado",null,null,null,null,null,null,null,{"$f":"+IF(AC1646=\"\",\"N\",\"S\")","v":"N"},null,null,null,null,"Condiciones que se deben cumplir para tener la calidad de beneficiario final - (Beneficiario Condicionado)"]
[]
[null,"Participación en el capital de la persona jurídica (%)",null,null,null,null,null,null,null,null,null,null,null,null,null,"Fecha desde la cual tiene la calidad de ben. final o existe la condición",null,null,null,null,null,null,null,null,null,null,null,null,null,null,null,null,null,"Fecha desde la cual deja de tener la calidad de ben. final o de existir la condición"]
[]
[null,{"$f":"+B1624+1","v":64},"Tipo Novedad"]
[null,{"$f":"+\"Beneficiario \"&B1650&\".\"","v":"Beneficiario 64."}]
[null,"Datos de los Beneficiarios Finales"]
[]
[null,"Nombre de la Empresa o Razón Social",null,null,null,null,null,null,null,null,null,null,null,null,null,null,null,null,null,null,null,null,null,null,null,null,null,null,null,null,null,null,null,null,null,null,null,null,null,null,null,null,null,null,null,null,null,null,"NIT - DV",null,null,null,null,null,null,null,null,null,null,"-"]
[]
[null,"Primer Nombre",null,null,null,null,null,null,null,null,null,null,null,null,"Otros Nombres",null,null,null,null,null,null,null,null,null,null,null,null,null,"Primer Apellido",null,null,null,null,null,null,null,null,null,null,null,null,null,null,null,null,"Segundo Apellido"]
[]
[null,"Tipo de Documento",null,null,null,null,null,null,null,null,null,null,null,null,"Número de identificación",null,null,null,null,null,null,null,null,null,null,null,null,null,"País de Expedición de Identificación"]
[]
[null,null,null,null,null,null,null,null,null,null,null,"Número de identificación Tributaria (NIT)",null,null,null,null,null,null,null,null,null,null,null,null,null,null,null,null,"País Expedición (NIT)"]
[]
[null,null,null,null,null,null,null,null,null,null,null,null,"Fecha de Nacimiento (PN)",null,null,null,null,null,null,null,null,null,null,null,null,null,null,null,"País de Nacimiento ",null,null,null,null,null,null,null,null,null,null,null,null,null,null,null,null,"País de Nacionalidad"]
[]
[null,"Dirección Residencia",null,null,null,null,null,null,null,null,null,null,null,null,null,null,null,null,null,"Departamento",null,null,null,null,null,null,null,null,null,null,null,null,null,null,"Municipio",null,null,null,null,null,null,null,null,null,"País de Residencia"]
[]
[null,null,null,null,null,null,null,null,null,null,null,null,null,null,null,null,null,null,null,"Código Postal",null,null,null,null,null,null,null,null,null,null,"Correo electrónico"]
[]
[null,"Beneficiario final de la estructura sin personería jurídica"]
[]
[null,"Fiduciante / Fideicomitente / Constituyente o posición similar o equivalente",null,null,null,null,null,null,null,null,null,null,null,null,null,null,"Comité financiero o posición similar o equivalente",null,null,null,null,null,null,null,null,null,null,null,null,"Fideicomisario / Beneficiario",null,null,null,null,null,null,null,null,null,null,"Ejerce control final y/o efectivo o tiene derecho a gozar y/o disponer de los activos, beneficios, resultados o utilidades"]
[]
[null,null,"Beneficiario Condicionado",null,null,null,null,null,null,null,{"$f":"+IF(AC1672=\"\",\"N\",\"S\")","v":"N"},null,null,null,null,"Condiciones que se deben cumplir para tener la calidad de beneficiario final - (Beneficiario Condicionado)"]
[]
[null,"Participación en el capital de la persona jurídica (%)",null,null,null,null,null,null,null,null,null,null,null,null,null,"Fecha desde la cual tiene la calidad de ben. final o existe la condición",null,null,null,null,null,null,null,null,null,null,null,null,null,null,null,null,null,"Fecha desde la cual deja de tener la calidad de ben. final o de existir la condición"]
[]
[null,{"$f":"+B1650+1","v":65},"Tipo Novedad"]
[null,{"$f":"+\"Beneficiario \"&B1676&\".\"","v":"Beneficiario 65."}]
[null,"Datos de los Beneficiarios Finales"]
[]
[null,"Nombre de la Empresa o Razón Social",null,null,null,null,null,null,null,null,null,null,null,null,null,null,null,null,null,null,null,null,null,null,null,null,null,null,null,null,null,null,null,null,null,null,null,null,null,null,null,null,null,null,null,null,null,null,"NIT - DV",null,null,null,null,null,null,null,null,null,null,"-"]
[]
[null,"Primer Nombre",null,null,null,null,null,null,null,null,null,null,null,null,"Otros Nombres",null,null,null,null,null,null,null,null,null,null,null,null,null,"Primer Apellido",null,null,null,null,null,null,null,null,null,null,null,null,null,null,null,null,"Segundo Apellido"]
[]
[null,"Tipo de Documento",null,null,null,null,null,null,null,null,null,null,null,null,"Número de identificación",null,null,null,null,null,null,null,null,null,null,null,null,null,"País de Expedición de Identificación"]
[]
[null,null,null,null,null,null,null,null,null,null,null,"Número de identificación Tributaria (NIT)",null,null,null,null,null,null,null,null,null,null,null,null,null,null,null,null,"País Expedición (NIT)"]
[]
[null,null,null,null,null,null,null,null,null,null,null,null,"Fecha de Nacimiento (PN)",null,null,null,null,null,null,null,null,null,null,null,null,null,null,null,"País de Nacimiento ",null,null,null,null,null,null,null,null,null,null,null,null,null,null,null,null,"País de Nacionalidad"]
[]
[null,"Dirección Residencia",null,null,null,null,null,null,null,null,null,null,null,null,null,null,null,null,null,"Departamento",null,null,null,null,null,null,null,null,null,null,null,null,null,null,"Municipio",null,null,null,null,null,null,null,null,null,"País de Residencia"]
[]
[null,null,null,null,null,null,null,null,null,null,null,null,null,null,null,null,null,null,null,"Código Postal",null,null,null,null,null,null,null,null,null,null,"Correo electrónico"]
[]
[null,"Beneficiario final de la estructura sin personería jurídica"]
[]
[null,"Fiduciante / Fideicomitente / Constituyente o posición similar o equivalente",null,null,null,null,null,null,null,null,null,null,null,null,null,null,"Comité financiero o posición similar o equivalente",null,null,null,null,null,null,null,null,null,null,null,null,"Fideicomisario / Beneficiario",null,null,null,null,null,null,null,null,null,null,"Ejerce control final y/o efectivo o tiene derecho a gozar y/o disponer de los activos, beneficios, resultados o utilidades"]
[]
[null,null,"Beneficiario Condicionado",null,null,null,null,null,null,null,{"$f":"+IF(AC1698=\"\",\"N\",\"S\")","v":"N"},null,null,null,null,"Condiciones que se deben cumplir para tener la calidad de beneficiario final - (Beneficiario Condicionado)"]
[]
[null,"Participación en el capital de la persona jurídica (%)",null,null,null,null,null,null,null,null,null,null,null,null,null,"Fecha desde la cual tiene la calidad de ben. final o existe la condición",null,null,null,null,null,null,null,null,null,null,null,null,null,null,null,null,null,"Fecha desde la cual deja de tener la calidad de ben. final o de existir la condición"]
[]
[null,{"$f":"+B1676+1","v":66},"Tipo Novedad"]
[null,{"$f":"+\"Beneficiario \"&B1702&\".\"","v":"Beneficiario 66."}]
[null,"Datos de los Beneficiarios Finales"]
[]
[null,"Nombre de la Empresa o Razón Social",null,null,null,null,null,null,null,null,null,null,null,null,null,null,null,null,null,null,null,null,null,null,null,null,null,null,null,null,null,null,null,null,null,null,null,null,null,null,null,null,null,null,null,null,null,null,"NIT - DV",null,null,null,null,null,null,null,null,null,null,"-"]
[]
[null,"Primer Nombre",null,null,null,null,null,null,null,null,null,null,null,null,"Otros Nombres",null,null,null,null,null,null,null,null,null,null,null,null,null,"Primer Apellido",null,null,null,null,null,null,null,null,null,null,null,null,null,null,null,null,"Segundo Apellido"]
[]
[null,"Tipo de Documento",null,null,null,null,null,null,null,null,null,null,null,null,"Número de identificación",null,null,null,null,null,null,null,null,null,null,null,null,null,"País de Expedición de Identificación"]
[]
[null,null,null,null,null,null,null,null,null,null,null,"Número de identificación Tributaria (NIT)",null,null,null,null,null,null,null,null,null,null,null,null,null,null,null,null,"País Expedición (NIT)"]
[]
[null,null,null,null,null,null,null,null,null,null,null,null,"Fecha de Nacimiento (PN)",null,null,null,null,null,null,null,null,null,null,null,null,null,null,null,"País de Nacimiento ",null,null,null,null,null,null,null,null,null,null,null,null,null,null,null,null,"País de Nacionalidad"]
[]
[null,"Dirección Residencia",null,null,null,null,null,null,null,null,null,null,null,null,null,null,null,null,null,"Departamento",null,null,null,null,null,null,null,null,null,null,null,null,null,null,"Municipio",null,null,null,null,null,null,null,null,null,"País de Residencia"]
[]
[null,null,null,null,null,null,null,null,null,null,null,null,null,null,null,null,null,null,null,"Código Postal",null,null,null,null,null,null,null,null,null,null,"Correo electrónico"]
[]
[null,"Beneficiario final de la estructura sin personería jurídica"]
[]
[null,"Fiduciante / Fideicomitente / Constituyente o posición similar o equivalente",null,null,null,null,null,null,null,null,null,null,null,null,null,null,"Comité financiero o posición similar o equivalente",null,null,null,null,null,null,null,null,null,null,null,null,"Fideicomisario / Beneficiario",null,null,null,null,null,null,null,null,null,null,"Ejerce control final y/o efectivo o tiene derecho a gozar y/o disponer de los activos, beneficios, resultados o utilidades"]
[]
[null,null,"Beneficiario Condicionado",null,null,null,null,null,null,null,{"$f":"+IF(AC1724=\"\",\"N\",\"S\")","v":"N"},null,null,null,null,"Condiciones que se deben cumplir para tener la calidad de beneficiario final - (Beneficiario Condicionado)"]
[]
[null,"Participación en el capital de la persona jurídica (%)",null,null,null,null,null,null,null,null,null,null,null,null,null,"Fecha desde la cual tiene la calidad de ben. final o existe la condición",null,null,null,null,null,null,null,null,null,null,null,null,null,null,null,null,null,"Fecha desde la cual deja de tener la calidad de ben. final o de existir la condición"]
[]
[null,{"$f":"+B1702+1","v":67},"Tipo Novedad"]
[null,{"$f":"+\"Beneficiario \"&B1728&\".\"","v":"Beneficiario 67."}]
[null,"Datos de los Beneficiarios Finales"]
[]
[null,"Nombre de la Empresa o Razón Social",null,null,null,null,null,null,null,null,null,null,null,null,null,null,null,null,null,null,null,null,null,null,null,null,null,null,null,null,null,null,null,null,null,null,null,null,null,null,null,null,null,null,null,null,null,null,"NIT - DV",null,null,null,null,null,null,null,null,null,null,"-"]
[]
[null,"Primer Nombre",null,null,null,null,null,null,null,null,null,null,null,null,"Otros Nombres",null,null,null,null,null,null,null,null,null,null,null,null,null,"Primer Apellido",null,null,null,null,null,null,null,null,null,null,null,null,null,null,null,null,"Segundo Apellido"]
[]
[null,"Tipo de Documento",null,null,null,null,null,null,null,null,null,null,null,null,"Número de identificación",null,null,null,null,null,null,null,null,null,null,null,null,null,"País de Expedición de Identificación"]
[]
[null,null,null,null,null,null,null,null,null,null,null,"Número de identificación Tributaria (NIT)",null,null,null,null,null,null,null,null,null,null,null,null,null,null,null,null,"País Expedición (NIT)"]
[]
[null,null,null,null,null,null,null,null,null,null,null,null,"Fecha de Nacimiento (PN)",null,null,null,null,null,null,null,null,null,null,null,null,null,null,null,"País de Nacimiento ",null,null,null,null,null,null,null,null,null,null,null,null,null,null,null,null,"País de Nacionalidad"]
[]
[null,"Dirección Residencia",null,null,null,null,null,null,null,null,null,null,null,null,null,null,null,null,null,"Departamento",null,null,null,null,null,null,null,null,null,null,null,null,null,null,"Municipio",null,null,null,null,null,null,null,null,null,"País de Residencia"]
[]
[null,null,null,null,null,null,null,null,null,null,null,null,null,null,null,null,null,null,null,"Código Postal",null,null,null,null,null,null,null,null,null,null,"Correo electrónico"]
[]
[null,"Beneficiario final de la estructura sin personería jurídica"]
[]
[null,"Fiduciante / Fideicomitente / Constituyente o posición similar o equivalente",null,null,null,null,null,null,null,null,null,null,null,null,null,null,"Comité financiero o posición similar o equivalente",null,null,null,null,null,null,null,null,null,null,null,null,"Fideicomisario / Beneficiario",null,null,null,null,null,null,null,null,null,null,"Ejerce control final y/o efectivo o tiene derecho a gozar y/o disponer de los activos, beneficios, resultados o utilidades"]
[]
[null,null,"Beneficiario Condicionado",null,null,null,null,null,null,null,{"$f":"+IF(AC1750=\"\",\"N\",\"S\")","v":"N"},null,null,null,null,"Condiciones que se deben cumplir para tener la calidad de beneficiario final - (Beneficiario Condicionado)"]
[]
[null,"Participación en el capital de la persona jurídica (%)",null,null,null,null,null,null,null,null,null,null,null,null,null,"Fecha desde la cual tiene la calidad de ben. final o existe la condición",null,null,null,null,null,null,null,null,null,null,null,null,null,null,null,null,null,"Fecha desde la cual deja de tener la calidad de ben. final o de existir la condición"]
[]
[null,{"$f":"+B1728+1","v":68},"Tipo Novedad"]
[null,{"$f":"+\"Beneficiario \"&B1754&\".\"","v":"Beneficiario 68."}]
[null,"Datos de los Beneficiarios Finales"]
[]
[null,"Nombre de la Empresa o Razón Social",null,null,null,null,null,null,null,null,null,null,null,null,null,null,null,null,null,null,null,null,null,null,null,null,null,null,null,null,null,null,null,null,null,null,null,null,null,null,null,null,null,null,null,null,null,null,"NIT - DV",null,null,null,null,null,null,null,null,null,null,"-"]
[]
[null,"Primer Nombre",null,null,null,null,null,null,null,null,null,null,null,null,"Otros Nombres",null,null,null,null,null,null,null,null,null,null,null,null,null,"Primer Apellido",null,null,null,null,null,null,null,null,null,null,null,null,null,null,null,null,"Segundo Apellido"]
[]
[null,"Tipo de Documento",null,null,null,null,null,null,null,null,null,null,null,null,"Número de identificación",null,null,null,null,null,null,null,null,null,null,null,null,null,"País de Expedición de Identificación"]
[]
[null,null,null,null,null,null,null,null,null,null,null,"Número de identificación Tributaria (NIT)",null,null,null,null,null,null,null,null,null,null,null,null,null,null,null,null,"País Expedición (NIT)"]
[]
[null,null,null,null,null,null,null,null,null,null,null,null,"Fecha de Nacimiento (PN)",null,null,null,null,null,null,null,null,null,null,null,null,null,null,null,"País de Nacimiento ",null,null,null,null,null,null,null,null,null,null,null,null,null,null,null,null,"País de Nacionalidad"]
[]
[null,"Dirección Residencia",null,null,null,null,null,null,null,null,null,null,null,null,null,null,null,null,null,"Departamento",null,null,null,null,null,null,null,null,null,null,null,null,null,null,"Municipio",null,null,null,null,null,null,null,null,null,"País de Residencia"]
[]
[null,null,null,null,null,null,null,null,null,null,null,null,null,null,null,null,null,null,null,"Código Postal",null,null,null,null,null,null,null,null,null,null,"Correo electrónico"]
[]
[null,"Beneficiario final de la estructura sin personería jurídica"]
[]
[null,"Fiduciante / Fideicomitente / Constituyente o posición similar o equivalente",null,null,null,null,null,null,null,null,null,null,null,null,null,null,"Comité financiero o posición similar o equivalente",null,null,null,null,null,null,null,null,null,null,null,null,"Fideicomisario / Beneficiario",null,null,null,null,null,null,null,null,null,null,"Ejerce control final y/o efectivo o tiene derecho a gozar y/o disponer de los activos, beneficios, resultados o utilidades"]
[]
[null,null,"Beneficiario Condicionado",null,null,null,null,null,null,null,{"$f":"+IF(AC1776=\"\",\"N\",\"S\")","v":"N"},null,null,null,null,"Condiciones que se deben cumplir para tener la calidad de beneficiario final - (Beneficiario Condicionado)"]
[]
[null,"Participación en el capital de la persona jurídica (%)",null,null,null,null,null,null,null,null,null,null,null,null,null,"Fecha desde la cual tiene la calidad de ben. final o existe la condición",null,null,null,null,null,null,null,null,null,null,null,null,null,null,null,null,null,"Fecha desde la cual deja de tener la calidad de ben. final o de existir la condición"]
[]
[null,{"$f":"+B1754+1","v":69},"Tipo Novedad"]
[null,{"$f":"+\"Beneficiario \"&B1780&\".\"","v":"Beneficiario 69."}]
[null,"Datos de los Beneficiarios Finales"]
[]
[null,"Nombre de la Empresa o Razón Social",null,null,null,null,null,null,null,null,null,null,null,null,null,null,null,null,null,null,null,null,null,null,null,null,null,null,null,null,null,null,null,null,null,null,null,null,null,null,null,null,null,null,null,null,null,null,"NIT - DV",null,null,null,null,null,null,null,null,null,null,"-"]
[]
[null,"Primer Nombre",null,null,null,null,null,null,null,null,null,null,null,null,"Otros Nombres",null,null,null,null,null,null,null,null,null,null,null,null,null,"Primer Apellido",null,null,null,null,null,null,null,null,null,null,null,null,null,null,null,null,"Segundo Apellido"]
[]
[null,"Tipo de Documento",null,null,null,null,null,null,null,null,null,null,null,null,"Número de identificación",null,null,null,null,null,null,null,null,null,null,null,null,null,"País de Expedición de Identificación"]
[]
[null,null,null,null,null,null,null,null,null,null,null,"Número de identificación Tributaria (NIT)",null,null,null,null,null,null,null,null,null,null,null,null,null,null,null,null,"País Expedición (NIT)"]
[]
[null,null,null,null,null,null,null,null,null,null,null,null,"Fecha de Nacimiento (PN)",null,null,null,null,null,null,null,null,null,null,null,null,null,null,null,"País de Nacimiento ",null,null,null,null,null,null,null,null,null,null,null,null,null,null,null,null,"País de Nacionalidad"]
[]
[null,"Dirección Residencia",null,null,null,null,null,null,null,null,null,null,null,null,null,null,null,null,null,"Departamento",null,null,null,null,null,null,null,null,null,null,null,null,null,null,"Municipio",null,null,null,null,null,null,null,null,null,"País de Residencia"]
[]
[null,null,null,null,null,null,null,null,null,null,null,null,null,null,null,null,null,null,null,"Código Postal",null,null,null,null,null,null,null,null,null,null,"Correo electrónico"]
[]
[null,"Beneficiario final de la estructura sin personería jurídica"]
[]
[null,"Fiduciante / Fideicomitente / Constituyente o posición similar o equivalente",null,null,null,null,null,null,null,null,null,null,null,null,null,null,"Comité financiero o posición similar o equivalente",null,null,null,null,null,null,null,null,null,null,null,null,"Fideicomisario / Beneficiario",null,null,null,null,null,null,null,null,null,null,"Ejerce control final y/o efectivo o tiene derecho a gozar y/o disponer de los activos, beneficios, resultados o utilidades"]
[]
[null,null,"Beneficiario Condicionado",null,null,null,null,null,null,null,{"$f":"+IF(AC1802=\"\",\"N\",\"S\")","v":"N"},null,null,null,null,"Condiciones que se deben cumplir para tener la calidad de beneficiario final - (Beneficiario Condicionado)"]
[]
[null,"Participación en el capital de la persona jurídica (%)",null,null,null,null,null,null,null,null,null,null,null,null,null,"Fecha desde la cual tiene la calidad de ben. final o existe la condición",null,null,null,null,null,null,null,null,null,null,null,null,null,null,null,null,null,"Fecha desde la cual deja de tener la calidad de ben. final o de existir la condición"]
[]
[null,{"$f":"+B1780+1","v":70},"Tipo Novedad"]
[null,{"$f":"+\"Beneficiario \"&B1806&\".\"","v":"Beneficiario 70."}]
[null,"Datos de los Beneficiarios Finales"]
[]
[null,"Nombre de la Empresa o Razón Social",null,null,null,null,null,null,null,null,null,null,null,null,null,null,null,null,null,null,null,null,null,null,null,null,null,null,null,null,null,null,null,null,null,null,null,null,null,null,null,null,null,null,null,null,null,null,"NIT - DV",null,null,null,null,null,null,null,null,null,null,"-"]
[]
[null,"Primer Nombre",null,null,null,null,null,null,null,null,null,null,null,null,"Otros Nombres",null,null,null,null,null,null,null,null,null,null,null,null,null,"Primer Apellido",null,null,null,null,null,null,null,null,null,null,null,null,null,null,null,null,"Segundo Apellido"]
[]
[null,"Tipo de Documento",null,null,null,null,null,null,null,null,null,null,null,null,"Número de identificación",null,null,null,null,null,null,null,null,null,null,null,null,null,"País de Expedición de Identificación"]
[]
[null,null,null,null,null,null,null,null,null,null,null,"Número de identificación Tributaria (NIT)",null,null,null,null,null,null,null,null,null,null,null,null,null,null,null,null,"País Expedición (NIT)"]
[]
[null,null,null,null,null,null,null,null,null,null,null,null,"Fecha de Nacimiento (PN)",null,null,null,null,null,null,null,null,null,null,null,null,null,null,null,"País de Nacimiento ",null,null,null,null,null,null,null,null,null,null,null,null,null,null,null,null,"País de Nacionalidad"]
[]
[null,"Dirección Residencia",null,null,null,null,null,null,null,null,null,null,null,null,null,null,null,null,null,"Departamento",null,null,null,null,null,null,null,null,null,null,null,null,null,null,"Municipio",null,null,null,null,null,null,null,null,null,"País de Residencia"]
[]
[null,null,null,null,null,null,null,null,null,null,null,null,null,null,null,null,null,null,null,"Código Postal",null,null,null,null,null,null,null,null,null,null,"Correo electrónico"]
[]
[null,"Beneficiario final de la estructura sin personería jurídica"]
[]
[null,"Fiduciante / Fideicomitente / Constituyente o posición similar o equivalente",null,null,null,null,null,null,null,null,null,null,null,null,null,null,"Comité financiero o posición similar o equivalente",null,null,null,null,null,null,null,null,null,null,null,null,"Fideicomisario / Beneficiario",null,null,null,null,null,null,null,null,null,null,"Ejerce control final y/o efectivo o tiene derecho a gozar y/o disponer de los activos, beneficios, resultados o utilidades"]
[]
[null,null,"Beneficiario Condicionado",null,null,null,null,null,null,null,{"$f":"+IF(AC1828=\"\",\"N\",\"S\")","v":"N"},null,null,null,null,"Condiciones que se deben cumplir para tener la calidad de beneficiario final - (Beneficiario Condicionado)"]
[]
[null,"Participación en el capital de la persona jurídica (%)",null,null,null,null,null,null,null,null,null,null,null,null,null,"Fecha desde la cual tiene la calidad de ben. final o existe la condición",null,null,null,null,null,null,null,null,null,null,null,null,null,null,null,null,null,"Fecha desde la cual deja de tener la calidad de ben. final o de existir la condición"]
[]
[null,{"$f":"+B1806+1","v":71},"Tipo Novedad"]
[null,{"$f":"+\"Beneficiario \"&B1832&\".\"","v":"Beneficiario 71."}]
[null,"Datos de los Beneficiarios Finales"]
[]
[null,"Nombre de la Empresa o Razón Social",null,null,null,null,null,null,null,null,null,null,null,null,null,null,null,null,null,null,null,null,null,null,null,null,null,null,null,null,null,null,null,null,null,null,null,null,null,null,null,null,null,null,null,null,null,null,"NIT - DV",null,null,null,null,null,null,null,null,null,null,"-"]
[]
[null,"Primer Nombre",null,null,null,null,null,null,null,null,null,null,null,null,"Otros Nombres",null,null,null,null,null,null,null,null,null,null,null,null,null,"Primer Apellido",null,null,null,null,null,null,null,null,null,null,null,null,null,null,null,null,"Segundo Apellido"]
[]
[null,"Tipo de Documento",null,null,null,null,null,null,null,null,null,null,null,null,"Número de identificación",null,null,null,null,null,null,null,null,null,null,null,null,null,"País de Expedición de Identificación"]
[]
[null,null,null,null,null,null,null,null,null,null,null,"Número de identificación Tributaria (NIT)",null,null,null,null,null,null,null,null,null,null,null,null,null,null,null,null,"País Expedición (NIT)"]
[]
[null,null,null,null,null,null,null,null,null,null,null,null,"Fecha de Nacimiento (PN)",null,null,null,null,null,null,null,null,null,null,null,null,null,null,null,"País de Nacimiento ",null,null,null,null,null,null,null,null,null,null,null,null,null,null,null,null,"País de Nacionalidad"]
[]
[null,"Dirección Residencia",null,null,null,null,null,null,null,null,null,null,null,null,null,null,null,null,null,"Departamento",null,null,null,null,null,null,null,null,null,null,null,null,null,null,"Municipio",null,null,null,null,null,null,null,null,null,"País de Residencia"]
[]
[null,null,null,null,null,null,null,null,null,null,null,null,null,null,null,null,null,null,null,"Código Postal",null,null,null,null,null,null,null,null,null,null,"Correo electrónico"]
[]
[null,"Beneficiario final de la estructura sin personería jurídica"]
[]
[null,"Fiduciante / Fideicomitente / Constituyente o posición similar o equivalente",null,null,null,null,null,null,null,null,null,null,null,null,null,null,"Comité financiero o posición similar o equivalente",null,null,null,null,null,null,null,null,null,null,null,null,"Fideicomisario / Beneficiario",null,null,null,null,null,null,null,null,null,null,"Ejerce control final y/o efectivo o tiene derecho a gozar y/o disponer de los activos, beneficios, resultados o utilidades"]
[]
[null,null,"Beneficiario Condicionado",null,null,null,null,null,null,null,{"$f":"+IF(AC1854=\"\",\"N\",\"S\")","v":"N"},null,null,null,null,"Condiciones que se deben cumplir para tener la calidad de beneficiario final - (Beneficiario Condicionado)"]
[]
[null,"Participación en el capital de la persona jurídica (%)",null,null,null,null,null,null,null,null,null,null,null,null,null,"Fecha desde la cual tiene la calidad de ben. final o existe la condición",null,null,null,null,null,null,null,null,null,null,null,null,null,null,null,null,null,"Fecha desde la cual deja de tener la calidad de ben. final o de existir la condición"]
[]
[null,{"$f":"+B1832+1","v":72},"Tipo Novedad"]
[null,{"$f":"+\"Beneficiario \"&B1858&\".\"","v":"Beneficiario 72."}]
[null,"Datos de los Beneficiarios Finales"]
[]
[null,"Nombre de la Empresa o Razón Social",null,null,null,null,null,null,null,null,null,null,null,null,null,null,null,null,null,null,null,null,null,null,null,null,null,null,null,null,null,null,null,null,null,null,null,null,null,null,null,null,null,null,null,null,null,null,"NIT - DV",null,null,null,null,null,null,null,null,null,null,"-"]
[]
[null,"Primer Nombre",null,null,null,null,null,null,null,null,null,null,null,null,"Otros Nombres",null,null,null,null,null,null,null,null,null,null,null,null,null,"Primer Apellido",null,null,null,null,null,null,null,null,null,null,null,null,null,null,null,null,"Segundo Apellido"]
[]
[null,"Tipo de Documento",null,null,null,null,null,null,null,null,null,null,null,null,"Número de identificación",null,null,null,null,null,null,null,null,null,null,null,null,null,"País de Expedición de Identificación"]
[]
[null,null,null,null,null,null,null,null,null,null,null,"Número de identificación Tributaria (NIT)",null,null,null,null,null,null,null,null,null,null,null,null,null,null,null,null,"País Expedición (NIT)"]
[]
[null,null,null,null,null,null,null,null,null,null,null,null,"Fecha de Nacimiento (PN)",null,null,null,null,null,null,null,null,null,null,null,null,null,null,null,"País de Nacimiento ",null,null,null,null,null,null,null,null,null,null,null,null,null,null,null,null,"País de Nacionalidad"]
[]
[null,"Dirección Residencia",null,null,null,null,null,null,null,null,null,null,null,null,null,null,null,null,null,"Departamento",null,null,null,null,null,null,null,null,null,null,null,null,null,null,"Municipio",null,null,null,null,null,null,null,null,null,"País de Residencia"]
[]
[null,null,null,null,null,null,null,null,null,null,null,null,null,null,null,null,null,null,null,"Código Postal",null,null,null,null,null,null,null,null,null,null,"Correo electrónico"]
[]
[null,"Beneficiario final de la estructura sin personería jurídica"]
[]
[null,"Fiduciante / Fideicomitente / Constituyente o posición similar o equivalente",null,null,null,null,null,null,null,null,null,null,null,null,null,null,"Comité financiero o posición similar o equivalente",null,null,null,null,null,null,null,null,null,null,null,null,"Fideicomisario / Beneficiario",null,null,null,null,null,null,null,null,null,null,"Ejerce control final y/o efectivo o tiene derecho a gozar y/o disponer de los activos, beneficios, resultados o utilidades"]
[]
[null,null,"Beneficiario Condicionado",null,null,null,null,null,null,null,{"$f":"+IF(AC1880=\"\",\"N\",\"S\")","v":"N"},null,null,null,null,"Condiciones que se deben cumplir para tener la calidad de beneficiario final - (Beneficiario Condicionado)"]
[]
[null,"Participación en el capital de la persona jurídica (%)",null,null,null,null,null,null,null,null,null,null,null,null,null,"Fecha desde la cual tiene la calidad de ben. final o existe la condición",null,null,null,null,null,null,null,null,null,null,null,null,null,null,null,null,null,"Fecha desde la cual deja de tener la calidad de ben. final o de existir la condición"]
[]
[null,{"$f":"+B1858+1","v":73},"Tipo Novedad"]
[null,{"$f":"+\"Beneficiario \"&B1884&\".\"","v":"Beneficiario 73."}]
[null,"Datos de los Beneficiarios Finales"]
[]
[null,"Nombre de la Empresa o Razón Social",null,null,null,null,null,null,null,null,null,null,null,null,null,null,null,null,null,null,null,null,null,null,null,null,null,null,null,null,null,null,null,null,null,null,null,null,null,null,null,null,null,null,null,null,null,null,"NIT - DV",null,null,null,null,null,null,null,null,null,null,"-"]
[]
[null,"Primer Nombre",null,null,null,null,null,null,null,null,null,null,null,null,"Otros Nombres",null,null,null,null,null,null,null,null,null,null,null,null,null,"Primer Apellido",null,null,null,null,null,null,null,null,null,null,null,null,null,null,null,null,"Segundo Apellido"]
[]
[null,"Tipo de Documento",null,null,null,null,null,null,null,null,null,null,null,null,"Número de identificación",null,null,null,null,null,null,null,null,null,null,null,null,null,"País de Expedición de Identificación"]
[]
[null,null,null,null,null,null,null,null,null,null,null,"Número de identificación Tributaria (NIT)",null,null,null,null,null,null,null,null,null,null,null,null,null,null,null,null,"País Expedición (NIT)"]
[]
[null,null,null,null,null,null,null,null,null,null,null,null,"Fecha de Nacimiento (PN)",null,null,null,null,null,null,null,null,null,null,null,null,null,null,null,"País de Nacimiento ",null,null,null,null,null,null,null,null,null,null,null,null,null,null,null,null,"País de Nacionalidad"]
[]
[null,"Dirección Residencia",null,null,null,null,null,null,null,null,null,null,null,null,null,null,null,null,null,"Departamento",null,null,null,null,null,null,null,null,null,null,null,null,null,null,"Municipio",null,null,null,null,null,null,null,null,null,"País de Residencia"]
[]
[null,null,null,null,null,null,null,null,null,null,null,null,null,null,null,null,null,null,null,"Código Postal",null,null,null,null,null,null,null,null,null,null,"Correo electrónico"]
[]
[null,"Beneficiario final de la estructura sin personería jurídica"]
[]
[null,"Fiduciante / Fideicomitente / Constituyente o posición similar o equivalente",null,null,null,null,null,null,null,null,null,null,null,null,null,null,"Comité financiero o posición similar o equivalente",null,null,null,null,null,null,null,null,null,null,null,null,"Fideicomisario / Beneficiario",null,null,null,null,null,null,null,null,null,null,"Ejerce control final y/o efectivo o tiene derecho a gozar y/o disponer de los activos, beneficios, resultados o utilidades"]
[]
[null,null,"Beneficiario Condicionado",null,null,null,null,null,null,null,{"$f":"+IF(AC1906=\"\",\"N\",\"S\")","v":"N"},null,null,null,null,"Condiciones que se deben cumplir para tener la calidad de beneficiario final - (Beneficiario Condicionado)"]
[]
[null,"Participación en el capital de la persona jurídica (%)",null,null,null,null,null,null,null,null,null,null,null,null,null,"Fecha desde la cual tiene la calidad de ben. final o existe la condición",null,null,null,null,null,null,null,null,null,null,null,null,null,null,null,null,null,"Fecha desde la cual deja de tener la calidad de ben. final o de existir la condición"]
[]
[null,{"$f":"+B1884+1","v":74},"Tipo Novedad"]
[null,{"$f":"+\"Beneficiario \"&B1910&\".\"","v":"Beneficiario 74."}]
[null,"Datos de los Beneficiarios Finales"]
[]
[null,"Nombre de la Empresa o Razón Social",null,null,null,null,null,null,null,null,null,null,null,null,null,null,null,null,null,null,null,null,null,null,null,null,null,null,null,null,null,null,null,null,null,null,null,null,null,null,null,null,null,null,null,null,null,null,"NIT - DV",null,null,null,null,null,null,null,null,null,null,"-"]
[]
[null,"Primer Nombre",null,null,null,null,null,null,null,null,null,null,null,null,"Otros Nombres",null,null,null,null,null,null,null,null,null,null,null,null,null,"Primer Apellido",null,null,null,null,null,null,null,null,null,null,null,null,null,null,null,null,"Segundo Apellido"]
[]
[null,"Tipo de Documento",null,null,null,null,null,null,null,null,null,null,null,null,"Número de identificación",null,null,null,null,null,null,null,null,null,null,null,null,null,"País de Expedición de Identificación"]
[]
[null,null,null,null,null,null,null,null,null,null,null,"Número de identificación Tributaria (NIT)",null,null,null,null,null,null,null,null,null,null,null,null,null,null,null,null,"País Expedición (NIT)"]
[]
[null,null,null,null,null,null,null,null,null,null,null,null,"Fecha de Nacimiento (PN)",null,null,null,null,null,null,null,null,null,null,null,null,null,null,null,"País de Nacimiento ",null,null,null,null,null,null,null,null,null,null,null,null,null,null,null,null,"País de Nacionalidad"]
[]
[null,"Dirección Residencia",null,null,null,null,null,null,null,null,null,null,null,null,null,null,null,null,null,"Departamento",null,null,null,null,null,null,null,null,null,null,null,null,null,null,"Municipio",null,null,null,null,null,null,null,null,null,"País de Residencia"]
[]
[null,null,null,null,null,null,null,null,null,null,null,null,null,null,null,null,null,null,null,"Código Postal",null,null,null,null,null,null,null,null,null,null,"Correo electrónico"]
[]
[null,"Beneficiario final de la estructura sin personería jurídica"]
[]
[null,"Fiduciante / Fideicomitente / Constituyente o posición similar o equivalente",null,null,null,null,null,null,null,null,null,null,null,null,null,null,"Comité financiero o posición similar o equivalente",null,null,null,null,null,null,null,null,null,null,null,null,"Fideicomisario / Beneficiario",null,null,null,null,null,null,null,null,null,null,"Ejerce control final y/o efectivo o tiene derecho a gozar y/o disponer de los activos, beneficios, resultados o utilidades"]
[]
[null,null,"Beneficiario Condicionado",null,null,null,null,null,null,null,{"$f":"+IF(AC1932=\"\",\"N\",\"S\")","v":"N"},null,null,null,null,"Condiciones que se deben cumplir para tener la calidad de beneficiario final - (Beneficiario Condicionado)"]
[]
[null,"Participación en el capital de la persona jurídica (%)",null,null,null,null,null,null,null,null,null,null,null,null,null,"Fecha desde la cual tiene la calidad de ben. final o existe la condición",null,null,null,null,null,null,null,null,null,null,null,null,null,null,null,null,null,"Fecha desde la cual deja de tener la calidad de ben. final o de existir la condición"]
[]
[null,{"$f":"+B1910+1","v":75},"Tipo Novedad"]
[null,{"$f":"+\"Beneficiario \"&B1936&\".\"","v":"Beneficiario 75."}]
[null,"Datos de los Beneficiarios Finales"]
[]
[null,"Nombre de la Empresa o Razón Social",null,null,null,null,null,null,null,null,null,null,null,null,null,null,null,null,null,null,null,null,null,null,null,null,null,null,null,null,null,null,null,null,null,null,null,null,null,null,null,null,null,null,null,null,null,null,"NIT - DV",null,null,null,null,null,null,null,null,null,null,"-"]
[]
[null,"Primer Nombre",null,null,null,null,null,null,null,null,null,null,null,null,"Otros Nombres",null,null,null,null,null,null,null,null,null,null,null,null,null,"Primer Apellido",null,null,null,null,null,null,null,null,null,null,null,null,null,null,null,null,"Segundo Apellido"]
[]
[null,"Tipo de Documento",null,null,null,null,null,null,null,null,null,null,null,null,"Número de identificación",null,null,null,null,null,null,null,null,null,null,null,null,null,"País de Expedición de Identificación"]
[]
[null,null,null,null,null,null,null,null,null,null,null,"Número de identificación Tributaria (NIT)",null,null,null,null,null,null,null,null,null,null,null,null,null,null,null,null,"País Expedición (NIT)"]
[]
[null,null,null,null,null,null,null,null,null,null,null,null,"Fecha de Nacimiento (PN)",null,null,null,null,null,null,null,null,null,null,null,null,null,null,null,"País de Nacimiento ",null,null,null,null,null,null,null,null,null,null,null,null,null,null,null,null,"País de Nacionalidad"]
[]
[null,"Dirección Residencia",null,null,null,null,null,null,null,null,null,null,null,null,null,null,null,null,null,"Departamento",null,null,null,null,null,null,null,null,null,null,null,null,null,null,"Municipio",null,null,null,null,null,null,null,null,null,"País de Residencia"]
[]
[null,null,null,null,null,null,null,null,null,null,null,null,null,null,null,null,null,null,null,"Código Postal",null,null,null,null,null,null,null,null,null,null,"Correo electrónico"]
[]
[null,"Beneficiario final de la estructura sin personería jurídica"]
[]
[null,"Fiduciante / Fideicomitente / Constituyente o posición similar o equivalente",null,null,null,null,null,null,null,null,null,null,null,null,null,null,"Comité financiero o posición similar o equivalente",null,null,null,null,null,null,null,null,null,null,null,null,"Fideicomisario / Beneficiario",null,null,null,null,null,null,null,null,null,null,"Ejerce control final y/o efectivo o tiene derecho a gozar y/o disponer de los activos, beneficios, resultados o utilidades"]
[]
[null,null,"Beneficiario Condicionado",null,null,null,null,null,null,null,{"$f":"+IF(AC1958=\"\",\"N\",\"S\")","v":"N"},null,null,null,null,"Condiciones que se deben cumplir para tener la calidad de beneficiario final - (Beneficiario Condicionado)"]
[]
[null,"Participación en el capital de la persona jurídica (%)",null,null,null,null,null,null,null,null,null,null,null,null,null,"Fecha desde la cual tiene la calidad de ben. final o existe la condición",null,null,null,null,null,null,null,null,null,null,null,null,null,null,null,null,null,"Fecha desde la cual deja de tener la calidad de ben. final o de existir la condición"]
[]
[null,{"$f":"+B1936+1","v":76},"Tipo Novedad"]
[null,{"$f":"+\"Beneficiario \"&B1962&\".\"","v":"Beneficiario 76."}]
[null,"Datos de los Beneficiarios Finales"]
[]
[null,"Nombre de la Empresa o Razón Social",null,null,null,null,null,null,null,null,null,null,null,null,null,null,null,null,null,null,null,null,null,null,null,null,null,null,null,null,null,null,null,null,null,null,null,null,null,null,null,null,null,null,null,null,null,null,"NIT - DV",null,null,null,null,null,null,null,null,null,null,"-"]
[]
[null,"Primer Nombre",null,null,null,null,null,null,null,null,null,null,null,null,"Otros Nombres",null,null,null,null,null,null,null,null,null,null,null,null,null,"Primer Apellido",null,null,null,null,null,null,null,null,null,null,null,null,null,null,null,null,"Segundo Apellido"]
[]
[null,"Tipo de Documento",null,null,null,null,null,null,null,null,null,null,null,null,"Número de identificación",null,null,null,null,null,null,null,null,null,null,null,null,null,"País de Expedición de Identificación"]
[]
[null,null,null,null,null,null,null,null,null,null,null,"Número de identificación Tributaria (NIT)",null,null,null,null,null,null,null,null,null,null,null,null,null,null,null,null,"País Expedición (NIT)"]
[]
[null,null,null,null,null,null,null,null,null,null,null,null,"Fecha de Nacimiento (PN)",null,null,null,null,null,null,null,null,null,null,null,null,null,null,null,"País de Nacimiento ",null,null,null,null,null,null,null,null,null,null,null,null,null,null,null,null,"País de Nacionalidad"]
[]
[null,"Dirección Residencia",null,null,null,null,null,null,null,null,null,null,null,null,null,null,null,null,null,"Departamento",null,null,null,null,null,null,null,null,null,null,null,null,null,null,"Municipio",null,null,null,null,null,null,null,null,null,"País de Residencia"]
[]
[null,null,null,null,null,null,null,null,null,null,null,null,null,null,null,null,null,null,null,"Código Postal",null,null,null,null,null,null,null,null,null,null,"Correo electrónico"]
[]
[null,"Beneficiario final de la estructura sin personería jurídica"]
[]
[null,"Fiduciante / Fideicomitente / Constituyente o posición similar o equivalente",null,null,null,null,null,null,null,null,null,null,null,null,null,null,"Comité financiero o posición similar o equivalente",null,null,null,null,null,null,null,null,null,null,null,null,"Fideicomisario / Beneficiario",null,null,null,null,null,null,null,null,null,null,"Ejerce control final y/o efectivo o tiene derecho a gozar y/o disponer de los activos, beneficios, resultados o utilidades"]
[]
[null,null,"Beneficiario Condicionado",null,null,null,null,null,null,null,{"$f":"+IF(AC1984=\"\",\"N\",\"S\")","v":"N"},null,null,null,null,"Condiciones que se deben cumplir para tener la calidad de beneficiario final - (Beneficiario Condicionado)"]
[]
[null,"Participación en el capital de la persona jurídica (%)",null,null,null,null,null,null,null,null,null,null,null,null,null,"Fecha desde la cual tiene la calidad de ben. final o existe la condición",null,null,null,null,null,null,null,null,null,null,null,null,null,null,null,null,null,"Fecha desde la cual deja de tener la calidad de ben. final o de existir la condición"]
[]
[null,{"$f":"+B1962+1","v":77},"Tipo Novedad"]
[null,{"$f":"+\"Beneficiario \"&B1988&\".\"","v":"Beneficiario 77."}]
[null,"Datos de los Beneficiarios Finales"]
[]
[null,"Nombre de la Empresa o Razón Social",null,null,null,null,null,null,null,null,null,null,null,null,null,null,null,null,null,null,null,null,null,null,null,null,null,null,null,null,null,null,null,null,null,null,null,null,null,null,null,null,null,null,null,null,null,null,"NIT - DV",null,null,null,null,null,null,null,null,null,null,"-"]
[]
[null,"Primer Nombre",null,null,null,null,null,null,null,null,null,null,null,null,"Otros Nombres",null,null,null,null,null,null,null,null,null,null,null,null,null,"Primer Apellido",null,null,null,null,null,null,null,null,null,null,null,null,null,null,null,null,"Segundo Apellido"]
[]
[null,"Tipo de Documento",null,null,null,null,null,null,null,null,null,null,null,null,"Número de identificación",null,null,null,null,null,null,null,null,null,null,null,null,null,"País de Expedición de Identificación"]
[]
[null,null,null,null,null,null,null,null,null,null,null,"Número de identificación Tributaria (NIT)",null,null,null,null,null,null,null,null,null,null,null,null,null,null,null,null,"País Expedición (NIT)"]
[]
[null,null,null,null,null,null,null,null,null,null,null,null,"Fecha de Nacimiento (PN)",null,null,null,null,null,null,null,null,null,null,null,null,null,null,null,"País de Nacimiento ",null,null,null,null,null,null,null,null,null,null,null,null,null,null,null,null,"País de Nacionalidad"]
[]
[null,"Dirección Residencia",null,null,null,null,null,null,null,null,null,null,null,null,null,null,null,null,null,"Departamento",null,null,null,null,null,null,null,null,null,null,null,null,null,null,"Municipio",null,null,null,null,null,null,null,null,null,"País de Residencia"]
[]
[null,null,null,null,null,null,null,null,null,null,null,null,null,null,null,null,null,null,null,"Código Postal",null,null,null,null,null,null,null,null,null,null,"Correo electrónico"]
[]
[null,"Beneficiario final de la estructura sin personería jurídica"]
[]
[null,"Fiduciante / Fideicomitente / Constituyente o posición similar o equivalente",null,null,null,null,null,null,null,null,null,null,null,null,null,null,"Comité financiero o posición similar o equivalente",null,null,null,null,null,null,null,null,null,null,null,null,"Fideicomisario / Beneficiario",null,null,null,null,null,null,null,null,null,null,"Ejerce control final y/o efectivo o tiene derecho a gozar y/o disponer de los activos, beneficios, resultados o utilidades"]
[]
[null,null,"Beneficiario Condicionado",null,null,null,null,null,null,null,{"$f":"+IF(AC2010=\"\",\"N\",\"S\")","v":"N"},null,null,null,null,"Condiciones que se deben cumplir para tener la calidad de beneficiario final - (Beneficiario Condicionado)"]
[]
[null,"Participación en el capital de la persona jurídica (%)",null,null,null,null,null,null,null,null,null,null,null,null,null,"Fecha desde la cual tiene la calidad de ben. final o existe la condición",null,null,null,null,null,null,null,null,null,null,null,null,null,null,null,null,null,"Fecha desde la cual deja de tener la calidad de ben. final o de existir la condición"]
[]
[null,{"$f":"+B1988+1","v":78},"Tipo Novedad"]
[null,{"$f":"+\"Beneficiario \"&B2014&\".\"","v":"Beneficiario 78."}]
[null,"Datos de los Beneficiarios Finales"]
[]
[null,"Nombre de la Empresa o Razón Social",null,null,null,null,null,null,null,null,null,null,null,null,null,null,null,null,null,null,null,null,null,null,null,null,null,null,null,null,null,null,null,null,null,null,null,null,null,null,null,null,null,null,null,null,null,null,"NIT - DV",null,null,null,null,null,null,null,null,null,null,"-"]
[]
[null,"Primer Nombre",null,null,null,null,null,null,null,null,null,null,null,null,"Otros Nombres",null,null,null,null,null,null,null,null,null,null,null,null,null,"Primer Apellido",null,null,null,null,null,null,null,null,null,null,null,null,null,null,null,null,"Segundo Apellido"]
[]
[null,"Tipo de Documento",null,null,null,null,null,null,null,null,null,null,null,null,"Número de identificación",null,null,null,null,null,null,null,null,null,null,null,null,null,"País de Expedición de Identificación"]
[]
[null,null,null,null,null,null,null,null,null,null,null,"Número de identificación Tributaria (NIT)",null,null,null,null,null,null,null,null,null,null,null,null,null,null,null,null,"País Expedición (NIT)"]
[]
[null,null,null,null,null,null,null,null,null,null,null,null,"Fecha de Nacimiento (PN)",null,null,null,null,null,null,null,null,null,null,null,null,null,null,null,"País de Nacimiento ",null,null,null,null,null,null,null,null,null,null,null,null,null,null,null,null,"País de Nacionalidad"]
[]
[null,"Dirección Residencia",null,null,null,null,null,null,null,null,null,null,null,null,null,null,null,null,null,"Departamento",null,null,null,null,null,null,null,null,null,null,null,null,null,null,"Municipio",null,null,null,null,null,null,null,null,null,"País de Residencia"]
[]
[null,null,null,null,null,null,null,null,null,null,null,null,null,null,null,null,null,null,null,"Código Postal",null,null,null,null,null,null,null,null,null,null,"Correo electrónico"]
[]
[null,"Beneficiario final de la estructura sin personería jurídica"]
[]
[null,"Fiduciante / Fideicomitente / Constituyente o posición similar o equivalente",null,null,null,null,null,null,null,null,null,null,null,null,null,null,"Comité financiero o posición similar o equivalente",null,null,null,null,null,null,null,null,null,null,null,null,"Fideicomisario / Beneficiario",null,null,null,null,null,null,null,null,null,null,"Ejerce control final y/o efectivo o tiene derecho a gozar y/o disponer de los activos, beneficios, resultados o utilidades"]
[]
[null,null,"Beneficiario Condicionado",null,null,null,null,null,null,null,{"$f":"+IF(AC2036=\"\",\"N\",\"S\")","v":"N"},null,null,null,null,"Condiciones que se deben cumplir para tener la calidad de beneficiario final - (Beneficiario Condicionado)"]
[]
[null,"Participación en el capital de la persona jurídica (%)",null,null,null,null,null,null,null,null,null,null,null,null,null,"Fecha desde la cual tiene la calidad de ben. final o existe la condición",null,null,null,null,null,null,null,null,null,null,null,null,null,null,null,null,null,"Fecha desde la cual deja de tener la calidad de ben. final o de existir la condición"]
[]
[null,{"$f":"+B2014+1","v":79},"Tipo Novedad"]
[null,{"$f":"+\"Beneficiario \"&B2040&\".\"","v":"Beneficiario 79."}]
[null,"Datos de los Beneficiarios Finales"]
[]
[null,"Nombre de la Empresa o Razón Social",null,null,null,null,null,null,null,null,null,null,null,null,null,null,null,null,null,null,null,null,null,null,null,null,null,null,null,null,null,null,null,null,null,null,null,null,null,null,null,null,null,null,null,null,null,null,"NIT - DV",null,null,null,null,null,null,null,null,null,null,"-"]
[]
[null,"Primer Nombre",null,null,null,null,null,null,null,null,null,null,null,null,"Otros Nombres",null,null,null,null,null,null,null,null,null,null,null,null,null,"Primer Apellido",null,null,null,null,null,null,null,null,null,null,null,null,null,null,null,null,"Segundo Apellido"]
[]
[null,"Tipo de Documento",null,null,null,null,null,null,null,null,null,null,null,null,"Número de identificación",null,null,null,null,null,null,null,null,null,null,null,null,null,"País de Expedición de Identificación"]
[]
[null,null,null,null,null,null,null,null,null,null,null,"Número de identificación Tributaria (NIT)",null,null,null,null,null,null,null,null,null,null,null,null,null,null,null,null,"País Expedición (NIT)"]
[]
[null,null,null,null,null,null,null,null,null,null,null,null,"Fecha de Nacimiento (PN)",null,null,null,null,null,null,null,null,null,null,null,null,null,null,null,"País de Nacimiento ",null,null,null,null,null,null,null,null,null,null,null,null,null,null,null,null,"País de Nacionalidad"]
[]
[null,"Dirección Residencia",null,null,null,null,null,null,null,null,null,null,null,null,null,null,null,null,null,"Departamento",null,null,null,null,null,null,null,null,null,null,null,null,null,null,"Municipio",null,null,null,null,null,null,null,null,null,"País de Residencia"]
[]
[null,null,null,null,null,null,null,null,null,null,null,null,null,null,null,null,null,null,null,"Código Postal",null,null,null,null,null,null,null,null,null,null,"Correo electrónico"]
[]
[null,"Beneficiario final de la estructura sin personería jurídica"]
[]
[null,"Fiduciante / Fideicomitente / Constituyente o posición similar o equivalente",null,null,null,null,null,null,null,null,null,null,null,null,null,null,"Comité financiero o posición similar o equivalente",null,null,null,null,null,null,null,null,null,null,null,null,"Fideicomisario / Beneficiario",null,null,null,null,null,null,null,null,null,null,"Ejerce control final y/o efectivo o tiene derecho a gozar y/o disponer de los activos, beneficios, resultados o utilidades"]
[]
[null,null,"Beneficiario Condicionado",null,null,null,null,null,null,null,{"$f":"+IF(AC2062=\"\",\"N\",\"S\")","v":"N"},null,null,null,null,"Condiciones que se deben cumplir para tener la calidad de beneficiario final - (Beneficiario Condicionado)"]
[]
[null,"Participación en el capital de la persona jurídica (%)",null,null,null,null,null,null,null,null,null,null,null,null,null,"Fecha desde la cual tiene la calidad de ben. final o existe la condición",null,null,null,null,null,null,null,null,null,null,null,null,null,null,null,null,null,"Fecha desde la cual deja de tener la calidad de ben. final o de existir la condición"]
[]
[null,{"$f":"+B2040+1","v":80},"Tipo Novedad"]
[null,{"$f":"+\"Beneficiario \"&B2066&\".\"","v":"Beneficiario 80."}]
[null,"Datos de los Beneficiarios Finales"]
[]
[null,"Nombre de la Empresa o Razón Social",null,null,null,null,null,null,null,null,null,null,null,null,null,null,null,null,null,null,null,null,null,null,null,null,null,null,null,null,null,null,null,null,null,null,null,null,null,null,null,null,null,null,null,null,null,null,"NIT - DV",null,null,null,null,null,null,null,null,null,null,"-"]
[]
[null,"Primer Nombre",null,null,null,null,null,null,null,null,null,null,null,null,"Otros Nombres",null,null,null,null,null,null,null,null,null,null,null,null,null,"Primer Apellido",null,null,null,null,null,null,null,null,null,null,null,null,null,null,null,null,"Segundo Apellido"]
[]
[null,"Tipo de Documento",null,null,null,null,null,null,null,null,null,null,null,null,"Número de identificación",null,null,null,null,null,null,null,null,null,null,null,null,null,"País de Expedición de Identificación"]
[]
[null,null,null,null,null,null,null,null,null,null,null,"Número de identificación Tributaria (NIT)",null,null,null,null,null,null,null,null,null,null,null,null,null,null,null,null,"País Expedición (NIT)"]
[]
[null,null,null,null,null,null,null,null,null,null,null,null,"Fecha de Nacimiento (PN)",null,null,null,null,null,null,null,null,null,null,null,null,null,null,null,"País de Nacimiento ",null,null,null,null,null,null,null,null,null,null,null,null,null,null,null,null,"País de Nacionalidad"]
[]
[null,"Dirección Residencia",null,null,null,null,null,null,null,null,null,null,null,null,null,null,null,null,null,"Departamento",null,null,null,null,null,null,null,null,null,null,null,null,null,null,"Municipio",null,null,null,null,null,null,null,null,null,"País de Residencia"]
[]
[null,null,null,null,null,null,null,null,null,null,null,null,null,null,null,null,null,null,null,"Código Postal",null,null,null,null,null,null,null,null,null,null,"Correo electrónico"]
[]
[null,"Beneficiario final de la estructura sin personería jurídica"]
[]
[null,"Fiduciante / Fideicomitente / Constituyente o posición similar o equivalente",null,null,null,null,null,null,null,null,null,null,null,null,null,null,"Comité financiero o posición similar o equivalente",null,null,null,null,null,null,null,null,null,null,null,null,"Fideicomisario / Beneficiario",null,null,null,null,null,null,null,null,null,null,"Ejerce control final y/o efectivo o tiene derecho a gozar y/o disponer de los activos, beneficios, resultados o utilidades"]
[]
[null,null,"Beneficiario Condicionado",null,null,null,null,null,null,null,{"$f":"+IF(AC2088=\"\",\"N\",\"S\")","v":"N"},null,null,null,null,"Condiciones que se deben cumplir para tener la calidad de beneficiario final - (Beneficiario Condicionado)"]
[]
[null,"Participación en el capital de la persona jurídica (%)",null,null,null,null,null,null,null,null,null,null,null,null,null,"Fecha desde la cual tiene la calidad de ben. final o existe la condición",null,null,null,null,null,null,null,null,null,null,null,null,null,null,null,null,null,"Fecha desde la cual deja de tener la calidad de ben. final o de existir la condición"]
[]
[null,{"$f":"+B2066+1","v":81},"Tipo Novedad"]
[null,{"$f":"+\"Beneficiario \"&B2092&\".\"","v":"Beneficiario 81."}]
[null,"Datos de los Beneficiarios Finales"]
[]
[null,"Nombre de la Empresa o Razón Social",null,null,null,null,null,null,null,null,null,null,null,null,null,null,null,null,null,null,null,null,null,null,null,null,null,null,null,null,null,null,null,null,null,null,null,null,null,null,null,null,null,null,null,null,null,null,"NIT - DV",null,null,null,null,null,null,null,null,null,null,"-"]
[]
[null,"Primer Nombre",null,null,null,null,null,null,null,null,null,null,null,null,"Otros Nombres",null,null,null,null,null,null,null,null,null,null,null,null,null,"Primer Apellido",null,null,null,null,null,null,null,null,null,null,null,null,null,null,null,null,"Segundo Apellido"]
[]
[null,"Tipo de Documento",null,null,null,null,null,null,null,null,null,null,null,null,"Número de identificación",null,null,null,null,null,null,null,null,null,null,null,null,null,"País de Expedición de Identificación"]
[]
[null,null,null,null,null,null,null,null,null,null,null,"Número de identificación Tributaria (NIT)",null,null,null,null,null,null,null,null,null,null,null,null,null,null,null,null,"País Expedición (NIT)"]
[]
[null,null,null,null,null,null,null,null,null,null,null,null,"Fecha de Nacimiento (PN)",null,null,null,null,null,null,null,null,null,null,null,null,null,null,null,"País de Nacimiento ",null,null,null,null,null,null,null,null,null,null,null,null,null,null,null,null,"País de Nacionalidad"]
[]
[null,"Dirección Residencia",null,null,null,null,null,null,null,null,null,null,null,null,null,null,null,null,null,"Departamento",null,null,null,null,null,null,null,null,null,null,null,null,null,null,"Municipio",null,null,null,null,null,null,null,null,null,"País de Residencia"]
[]
[null,null,null,null,null,null,null,null,null,null,null,null,null,null,null,null,null,null,null,"Código Postal",null,null,null,null,null,null,null,null,null,null,"Correo electrónico"]
[]
[null,"Beneficiario final de la estructura sin personería jurídica"]
[]
[null,"Fiduciante / Fideicomitente / Constituyente o posición similar o equivalente",null,null,null,null,null,null,null,null,null,null,null,null,null,null,"Comité financiero o posición similar o equivalente",null,null,null,null,null,null,null,null,null,null,null,null,"Fideicomisario / Beneficiario",null,null,null,null,null,null,null,null,null,null,"Ejerce control final y/o efectivo o tiene derecho a gozar y/o disponer de los activos, beneficios, resultados o utilidades"]
[]
[null,null,"Beneficiario Condicionado",null,null,null,null,null,null,null,{"$f":"+IF(AC2114=\"\",\"N\",\"S\")","v":"N"},null,null,null,null,"Condiciones que se deben cumplir para tener la calidad de beneficiario final - (Beneficiario Condicionado)"]
[]
[null,"Participación en el capital de la persona jurídica (%)",null,null,null,null,null,null,null,null,null,null,null,null,null,"Fecha desde la cual tiene la calidad de ben. final o existe la condición",null,null,null,null,null,null,null,null,null,null,null,null,null,null,null,null,null,"Fecha desde la cual deja de tener la calidad de ben. final o de existir la condición"]
[]
[null,{"$f":"+B2092+1","v":82},"Tipo Novedad"]
[null,{"$f":"+\"Beneficiario \"&B2118&\".\"","v":"Beneficiario 82."}]
[null,"Datos de los Beneficiarios Finales"]
[]
[null,"Nombre de la Empresa o Razón Social",null,null,null,null,null,null,null,null,null,null,null,null,null,null,null,null,null,null,null,null,null,null,null,null,null,null,null,null,null,null,null,null,null,null,null,null,null,null,null,null,null,null,null,null,null,null,"NIT - DV",null,null,null,null,null,null,null,null,null,null,"-"]
[]
[null,"Primer Nombre",null,null,null,null,null,null,null,null,null,null,null,null,"Otros Nombres",null,null,null,null,null,null,null,null,null,null,null,null,null,"Primer Apellido",null,null,null,null,null,null,null,null,null,null,null,null,null,null,null,null,"Segundo Apellido"]
[]
[null,"Tipo de Documento",null,null,null,null,null,null,null,null,null,null,null,null,"Número de identificación",null,null,null,null,null,null,null,null,null,null,null,null,null,"País de Expedición de Identificación"]
[]
[null,null,null,null,null,null,null,null,null,null,null,"Número de identificación Tributaria (NIT)",null,null,null,null,null,null,null,null,null,null,null,null,null,null,null,null,"País Expedición (NIT)"]
[]
[null,null,null,null,null,null,null,null,null,null,null,null,"Fecha de Nacimiento (PN)",null,null,null,null,null,null,null,null,null,null,null,null,null,null,null,"País de Nacimiento ",null,null,null,null,null,null,null,null,null,null,null,null,null,null,null,null,"País de Nacionalidad"]
[]
[null,"Dirección Residencia",null,null,null,null,null,null,null,null,null,null,null,null,null,null,null,null,null,"Departamento",null,null,null,null,null,null,null,null,null,null,null,null,null,null,"Municipio",null,null,null,null,null,null,null,null,null,"País de Residencia"]
[]
[null,null,null,null,null,null,null,null,null,null,null,null,null,null,null,null,null,null,null,"Código Postal",null,null,null,null,null,null,null,null,null,null,"Correo electrónico"]
[]
[null,"Beneficiario final de la estructura sin personería jurídica"]
[]
[null,"Fiduciante / Fideicomitente / Constituyente o posición similar o equivalente",null,null,null,null,null,null,null,null,null,null,null,null,null,null,"Comité financiero o posición similar o equivalente",null,null,null,null,null,null,null,null,null,null,null,null,"Fideicomisario / Beneficiario",null,null,null,null,null,null,null,null,null,null,"Ejerce control final y/o efectivo o tiene derecho a gozar y/o disponer de los activos, beneficios, resultados o utilidades"]
[]
[null,null,"Beneficiario Condicionado",null,null,null,null,null,null,null,{"$f":"+IF(AC2140=\"\",\"N\",\"S\")","v":"N"},null,null,null,null,"Condiciones que se deben cumplir para tener la calidad de beneficiario final - (Beneficiario Condicionado)"]
[]
[null,"Participación en el capital de la persona jurídica (%)",null,null,null,null,null,null,null,null,null,null,null,null,null,"Fecha desde la cual tiene la calidad de ben. final o existe la condición",null,null,null,null,null,null,null,null,null,null,null,null,null,null,null,null,null,"Fecha desde la cual deja de tener la calidad de ben. final o de existir la condición"]
[]
[null,{"$f":"+B2118+1","v":83},"Tipo Novedad"]
[null,{"$f":"+\"Beneficiario \"&B2144&\".\"","v":"Beneficiario 83."}]
[null,"Datos de los Beneficiarios Finales"]
[]
[null,"Nombre de la Empresa o Razón Social",null,null,null,null,null,null,null,null,null,null,null,null,null,null,null,null,null,null,null,null,null,null,null,null,null,null,null,null,null,null,null,null,null,null,null,null,null,null,null,null,null,null,null,null,null,null,"NIT - DV",null,null,null,null,null,null,null,null,null,null,"-"]
[]
[null,"Primer Nombre",null,null,null,null,null,null,null,null,null,null,null,null,"Otros Nombres",null,null,null,null,null,null,null,null,null,null,null,null,null,"Primer Apellido",null,null,null,null,null,null,null,null,null,null,null,null,null,null,null,null,"Segundo Apellido"]
[]
[null,"Tipo de Documento",null,null,null,null,null,null,null,null,null,null,null,null,"Número de identificación",null,null,null,null,null,null,null,null,null,null,null,null,null,"País de Expedición de Identificación"]
[]
[null,null,null,null,null,null,null,null,null,null,null,"Número de identificación Tributaria (NIT)",null,null,null,null,null,null,null,null,null,null,null,null,null,null,null,null,"País Expedición (NIT)"]
[]
[null,null,null,null,null,null,null,null,null,null,null,null,"Fecha de Nacimiento (PN)",null,null,null,null,null,null,null,null,null,null,null,null,null,null,null,"País de Nacimiento ",null,null,null,null,null,null,null,null,null,null,null,null,null,null,null,null,"País de Nacionalidad"]
[]
[null,"Dirección Residencia",null,null,null,null,null,null,null,null,null,null,null,null,null,null,null,null,null,"Departamento",null,null,null,null,null,null,null,null,null,null,null,null,null,null,"Municipio",null,null,null,null,null,null,null,null,null,"País de Residencia"]
[]
[null,null,null,null,null,null,null,null,null,null,null,null,null,null,null,null,null,null,null,"Código Postal",null,null,null,null,null,null,null,null,null,null,"Correo electrónico"]
[]
[null,"Beneficiario final de la estructura sin personería jurídica"]
[]
[null,"Fiduciante / Fideicomitente / Constituyente o posición similar o equivalente",null,null,null,null,null,null,null,null,null,null,null,null,null,null,"Comité financiero o posición similar o equivalente",null,null,null,null,null,null,null,null,null,null,null,null,"Fideicomisario / Beneficiario",null,null,null,null,null,null,null,null,null,null,"Ejerce control final y/o efectivo o tiene derecho a gozar y/o disponer de los activos, beneficios, resultados o utilidades"]
[]
[null,null,"Beneficiario Condicionado",null,null,null,null,null,null,null,{"$f":"+IF(AC2166=\"\",\"N\",\"S\")","v":"N"},null,null,null,null,"Condiciones que se deben cumplir para tener la calidad de beneficiario final - (Beneficiario Condicionado)"]
[]
[null,"Participación en el capital de la persona jurídica (%)",null,null,null,null,null,null,null,null,null,null,null,null,null,"Fecha desde la cual tiene la calidad de ben. final o existe la condición",null,null,null,null,null,null,null,null,null,null,null,null,null,null,null,null,null,"Fecha desde la cual deja de tener la calidad de ben. final o de existir la condición"]
[]
[null,{"$f":"+B2144+1","v":84},"Tipo Novedad"]
[null,{"$f":"+\"Beneficiario \"&B2170&\".\"","v":"Beneficiario 84."}]
[null,"Datos de los Beneficiarios Finales"]
[]
[null,"Nombre de la Empresa o Razón Social",null,null,null,null,null,null,null,null,null,null,null,null,null,null,null,null,null,null,null,null,null,null,null,null,null,null,null,null,null,null,null,null,null,null,null,null,null,null,null,null,null,null,null,null,null,null,"NIT - DV",null,null,null,null,null,null,null,null,null,null,"-"]
[]
[null,"Primer Nombre",null,null,null,null,null,null,null,null,null,null,null,null,"Otros Nombres",null,null,null,null,null,null,null,null,null,null,null,null,null,"Primer Apellido",null,null,null,null,null,null,null,null,null,null,null,null,null,null,null,null,"Segundo Apellido"]
[]
[null,"Tipo de Documento",null,null,null,null,null,null,null,null,null,null,null,null,"Número de identificación",null,null,null,null,null,null,null,null,null,null,null,null,null,"País de Expedición de Identificación"]
[]
[null,null,null,null,null,null,null,null,null,null,null,"Número de identificación Tributaria (NIT)",null,null,null,null,null,null,null,null,null,null,null,null,null,null,null,null,"País Expedición (NIT)"]
[]
[null,null,null,null,null,null,null,null,null,null,null,null,"Fecha de Nacimiento (PN)",null,null,null,null,null,null,null,null,null,null,null,null,null,null,null,"País de Nacimiento ",null,null,null,null,null,null,null,null,null,null,null,null,null,null,null,null,"País de Nacionalidad"]
[]
[null,"Dirección Residencia",null,null,null,null,null,null,null,null,null,null,null,null,null,null,null,null,null,"Departamento",null,null,null,null,null,null,null,null,null,null,null,null,null,null,"Municipio",null,null,null,null,null,null,null,null,null,"País de Residencia"]
[]
[null,null,null,null,null,null,null,null,null,null,null,null,null,null,null,null,null,null,null,"Código Postal",null,null,null,null,null,null,null,null,null,null,"Correo electrónico"]
[]
[null,"Beneficiario final de la estructura sin personería jurídica"]
[]
[null,"Fiduciante / Fideicomitente / Constituyente o posición similar o equivalente",null,null,null,null,null,null,null,null,null,null,null,null,null,null,"Comité financiero o posición similar o equivalente",null,null,null,null,null,null,null,null,null,null,null,null,"Fideicomisario / Beneficiario",null,null,null,null,null,null,null,null,null,null,"Ejerce control final y/o efectivo o tiene derecho a gozar y/o disponer de los activos, beneficios, resultados o utilidades"]
[]
[null,null,"Beneficiario Condicionado",null,null,null,null,null,null,null,{"$f":"+IF(AC2192=\"\",\"N\",\"S\")","v":"N"},null,null,null,null,"Condiciones que se deben cumplir para tener la calidad de beneficiario final - (Beneficiario Condicionado)"]
[]
[null,"Participación en el capital de la persona jurídica (%)",null,null,null,null,null,null,null,null,null,null,null,null,null,"Fecha desde la cual tiene la calidad de ben. final o existe la condición",null,null,null,null,null,null,null,null,null,null,null,null,null,null,null,null,null,"Fecha desde la cual deja de tener la calidad de ben. final o de existir la condición"]
[]
[null,{"$f":"+B2170+1","v":85},"Tipo Novedad"]
[null,{"$f":"+\"Beneficiario \"&B2196&\".\"","v":"Beneficiario 85."}]
[null,"Datos de los Beneficiarios Finales"]
[]
[null,"Nombre de la Empresa o Razón Social",null,null,null,null,null,null,null,null,null,null,null,null,null,null,null,null,null,null,null,null,null,null,null,null,null,null,null,null,null,null,null,null,null,null,null,null,null,null,null,null,null,null,null,null,null,null,"NIT - DV",null,null,null,null,null,null,null,null,null,null,"-"]
[]
[null,"Primer Nombre",null,null,null,null,null,null,null,null,null,null,null,null,"Otros Nombres",null,null,null,null,null,null,null,null,null,null,null,null,null,"Primer Apellido",null,null,null,null,null,null,null,null,null,null,null,null,null,null,null,null,"Segundo Apellido"]
[]
[null,"Tipo de Documento",null,null,null,null,null,null,null,null,null,null,null,null,"Número de identificación",null,null,null,null,null,null,null,null,null,null,null,null,null,"País de Expedición de Identificación"]
[]
[null,null,null,null,null,null,null,null,null,null,null,"Número de identificación Tributaria (NIT)",null,null,null,null,null,null,null,null,null,null,null,null,null,null,null,null,"País Expedición (NIT)"]
[]
[null,null,null,null,null,null,null,null,null,null,null,null,"Fecha de Nacimiento (PN)",null,null,null,null,null,null,null,null,null,null,null,null,null,null,null,"País de Nacimiento ",null,null,null,null,null,null,null,null,null,null,null,null,null,null,null,null,"País de Nacionalidad"]
[]
[null,"Dirección Residencia",null,null,null,null,null,null,null,null,null,null,null,null,null,null,null,null,null,"Departamento",null,null,null,null,null,null,null,null,null,null,null,null,null,null,"Municipio",null,null,null,null,null,null,null,null,null,"País de Residencia"]
[]
[null,null,null,null,null,null,null,null,null,null,null,null,null,null,null,null,null,null,null,"Código Postal",null,null,null,null,null,null,null,null,null,null,"Correo electrónico"]
[]
[null,"Beneficiario final de la estructura sin personería jurídica"]
[]
[null,"Fiduciante / Fideicomitente / Constituyente o posición similar o equivalente",null,null,null,null,null,null,null,null,null,null,null,null,null,null,"Comité financiero o posición similar o equivalente",null,null,null,null,null,null,null,null,null,null,null,null,"Fideicomisario / Beneficiario",null,null,null,null,null,null,null,null,null,null,"Ejerce control final y/o efectivo o tiene derecho a gozar y/o disponer de los activos, beneficios, resultados o utilidades"]
[]
[null,null,"Beneficiario Condicionado",null,null,null,null,null,null,null,{"$f":"+IF(AC2218=\"\",\"N\",\"S\")","v":"N"},null,null,null,null,"Condiciones que se deben cumplir para tener la calidad de beneficiario final - (Beneficiario Condicionado)"]
[]
[null,"Participación en el capital de la persona jurídica (%)",null,null,null,null,null,null,null,null,null,null,null,null,null,"Fecha desde la cual tiene la calidad de ben. final o existe la condición",null,null,null,null,null,null,null,null,null,null,null,null,null,null,null,null,null,"Fecha desde la cual deja de tener la calidad de ben. final o de existir la condición"]
[]
[null,{"$f":"+B2196+1","v":86},"Tipo Novedad"]
[null,{"$f":"+\"Beneficiario \"&B2222&\".\"","v":"Beneficiario 86."}]
[null,"Datos de los Beneficiarios Finales"]
[]
[null,"Nombre de la Empresa o Razón Social",null,null,null,null,null,null,null,null,null,null,null,null,null,null,null,null,null,null,null,null,null,null,null,null,null,null,null,null,null,null,null,null,null,null,null,null,null,null,null,null,null,null,null,null,null,null,"NIT - DV",null,null,null,null,null,null,null,null,null,null,"-"]
[]
[null,"Primer Nombre",null,null,null,null,null,null,null,null,null,null,null,null,"Otros Nombres",null,null,null,null,null,null,null,null,null,null,null,null,null,"Primer Apellido",null,null,null,null,null,null,null,null,null,null,null,null,null,null,null,null,"Segundo Apellido"]
[]
[null,"Tipo de Documento",null,null,null,null,null,null,null,null,null,null,null,null,"Número de identificación",null,null,null,null,null,null,null,null,null,null,null,null,null,"País de Expedición de Identificación"]
[]
[null,null,null,null,null,null,null,null,null,null,null,"Número de identificación Tributaria (NIT)",null,null,null,null,null,null,null,null,null,null,null,null,null,null,null,null,"País Expedición (NIT)"]
[]
[null,null,null,null,null,null,null,null,null,null,null,null,"Fecha de Nacimiento (PN)",null,null,null,null,null,null,null,null,null,null,null,null,null,null,null,"País de Nacimiento ",null,null,null,null,null,null,null,null,null,null,null,null,null,null,null,null,"País de Nacionalidad"]
[]
[null,"Dirección Residencia",null,null,null,null,null,null,null,null,null,null,null,null,null,null,null,null,null,"Departamento",null,null,null,null,null,null,null,null,null,null,null,null,null,null,"Municipio",null,null,null,null,null,null,null,null,null,"País de Residencia"]
[]
[null,null,null,null,null,null,null,null,null,null,null,null,null,null,null,null,null,null,null,"Código Postal",null,null,null,null,null,null,null,null,null,null,"Correo electrónico"]
[]
[null,"Beneficiario final de la estructura sin personería jurídica"]
[]
[null,"Fiduciante / Fideicomitente / Constituyente o posición similar o equivalente",null,null,null,null,null,null,null,null,null,null,null,null,null,null,"Comité financiero o posición similar o equivalente",null,null,null,null,null,null,null,null,null,null,null,null,"Fideicomisario / Beneficiario",null,null,null,null,null,null,null,null,null,null,"Ejerce control final y/o efectivo o tiene derecho a gozar y/o disponer de los activos, beneficios, resultados o utilidades"]
[]
[null,null,"Beneficiario Condicionado",null,null,null,null,null,null,null,{"$f":"+IF(AC2244=\"\",\"N\",\"S\")","v":"N"},null,null,null,null,"Condiciones que se deben cumplir para tener la calidad de beneficiario final - (Beneficiario Condicionado)"]
[]
[null,"Participación en el capital de la persona jurídica (%)",null,null,null,null,null,null,null,null,null,null,null,null,null,"Fecha desde la cual tiene la calidad de ben. final o existe la condición",null,null,null,null,null,null,null,null,null,null,null,null,null,null,null,null,null,"Fecha desde la cual deja de tener la calidad de ben. final o de existir la condición"]
[]
[null,{"$f":"+B2222+1","v":87},"Tipo Novedad"]
[null,{"$f":"+\"Beneficiario \"&B2248&\".\"","v":"Beneficiario 87."}]
[null,"Datos de los Beneficiarios Finales"]
[]
[null,"Nombre de la Empresa o Razón Social",null,null,null,null,null,null,null,null,null,null,null,null,null,null,null,null,null,null,null,null,null,null,null,null,null,null,null,null,null,null,null,null,null,null,null,null,null,null,null,null,null,null,null,null,null,null,"NIT - DV",null,null,null,null,null,null,null,null,null,null,"-"]
[]
[null,"Primer Nombre",null,null,null,null,null,null,null,null,null,null,null,null,"Otros Nombres",null,null,null,null,null,null,null,null,null,null,null,null,null,"Primer Apellido",null,null,null,null,null,null,null,null,null,null,null,null,null,null,null,null,"Segundo Apellido"]
[]
[null,"Tipo de Documento",null,null,null,null,null,null,null,null,null,null,null,null,"Número de identificación",null,null,null,null,null,null,null,null,null,null,null,null,null,"País de Expedición de Identificación"]
[]
[null,null,null,null,null,null,null,null,null,null,null,"Número de identificación Tributaria (NIT)",null,null,null,null,null,null,null,null,null,null,null,null,null,null,null,null,"País Expedición (NIT)"]
[]
[null,null,null,null,null,null,null,null,null,null,null,null,"Fecha de Nacimiento (PN)",null,null,null,null,null,null,null,null,null,null,null,null,null,null,null,"País de Nacimiento ",null,null,null,null,null,null,null,null,null,null,null,null,null,null,null,null,"País de Nacionalidad"]
[]
[null,"Dirección Residencia",null,null,null,null,null,null,null,null,null,null,null,null,null,null,null,null,null,"Departamento",null,null,null,null,null,null,null,null,null,null,null,null,null,null,"Municipio",null,null,null,null,null,null,null,null,null,"País de Residencia"]
[]
[null,null,null,null,null,null,null,null,null,null,null,null,null,null,null,null,null,null,null,"Código Postal",null,null,null,null,null,null,null,null,null,null,"Correo electrónico"]
[]
[null,"Beneficiario final de la estructura sin personería jurídica"]
[]
[null,"Fiduciante / Fideicomitente / Constituyente o posición similar o equivalente",null,null,null,null,null,null,null,null,null,null,null,null,null,null,"Comité financiero o posición similar o equivalente",null,null,null,null,null,null,null,null,null,null,null,null,"Fideicomisario / Beneficiario",null,null,null,null,null,null,null,null,null,null,"Ejerce control final y/o efectivo o tiene derecho a gozar y/o disponer de los activos, beneficios, resultados o utilidades"]
[]
[null,null,"Beneficiario Condicionado",null,null,null,null,null,null,null,{"$f":"+IF(AC2270=\"\",\"N\",\"S\")","v":"N"},null,null,null,null,"Condiciones que se deben cumplir para tener la calidad de beneficiario final - (Beneficiario Condicionado)"]
[]
[null,"Participación en el capital de la persona jurídica (%)",null,null,null,null,null,null,null,null,null,null,null,null,null,"Fecha desde la cual tiene la calidad de ben. final o existe la condición",null,null,null,null,null,null,null,null,null,null,null,null,null,null,null,null,null,"Fecha desde la cual deja de tener la calidad de ben. final o de existir la condición"]
[]
[null,{"$f":"+B2248+1","v":88},"Tipo Novedad"]
[null,{"$f":"+\"Beneficiario \"&B2274&\".\"","v":"Beneficiario 88."}]
[null,"Datos de los Beneficiarios Finales"]
[]
[null,"Nombre de la Empresa o Razón Social",null,null,null,null,null,null,null,null,null,null,null,null,null,null,null,null,null,null,null,null,null,null,null,null,null,null,null,null,null,null,null,null,null,null,null,null,null,null,null,null,null,null,null,null,null,null,"NIT - DV",null,null,null,null,null,null,null,null,null,null,"-"]
[]
[null,"Primer Nombre",null,null,null,null,null,null,null,null,null,null,null,null,"Otros Nombres",null,null,null,null,null,null,null,null,null,null,null,null,null,"Primer Apellido",null,null,null,null,null,null,null,null,null,null,null,null,null,null,null,null,"Segundo Apellido"]
[]
[null,"Tipo de Documento",null,null,null,null,null,null,null,null,null,null,null,null,"Número de identificación",null,null,null,null,null,null,null,null,null,null,null,null,null,"País de Expedición de Identificación"]
[]
[null,null,null,null,null,null,null,null,null,null,null,"Número de identificación Tributaria (NIT)",null,null,null,null,null,null,null,null,null,null,null,null,null,null,null,null,"País Expedición (NIT)"]
[]
[null,null,null,null,null,null,null,null,null,null,null,null,"Fecha de Nacimiento (PN)",null,null,null,null,null,null,null,null,null,null,null,null,null,null,null,"País de Nacimiento ",null,null,null,null,null,null,null,null,null,null,null,null,null,null,null,null,"País de Nacionalidad"]
[]
[null,"Dirección Residencia",null,null,null,null,null,null,null,null,null,null,null,null,null,null,null,null,null,"Departamento",null,null,null,null,null,null,null,null,null,null,null,null,null,null,"Municipio",null,null,null,null,null,null,null,null,null,"País de Residencia"]
[]
[null,null,null,null,null,null,null,null,null,null,null,null,null,null,null,null,null,null,null,"Código Postal",null,null,null,null,null,null,null,null,null,null,"Correo electrónico"]
[]
[null,"Beneficiario final de la estructura sin personería jurídica"]
[]
[null,"Fiduciante / Fideicomitente / Constituyente o posición similar o equivalente",null,null,null,null,null,null,null,null,null,null,null,null,null,null,"Comité financiero o posición similar o equivalente",null,null,null,null,null,null,null,null,null,null,null,null,"Fideicomisario / Beneficiario",null,null,null,null,null,null,null,null,null,null,"Ejerce control final y/o efectivo o tiene derecho a gozar y/o disponer de los activos, beneficios, resultados o utilidades"]
[]
[null,null,"Beneficiario Condicionado",null,null,null,null,null,null,null,{"$f":"+IF(AC2296=\"\",\"N\",\"S\")","v":"N"},null,null,null,null,"Condiciones que se deben cumplir para tener la calidad de beneficiario final - (Beneficiario Condicionado)"]
[]
[null,"Participación en el capital de la persona jurídica (%)",null,null,null,null,null,null,null,null,null,null,null,null,null,"Fecha desde la cual tiene la calidad de ben. final o existe la condición",null,null,null,null,null,null,null,null,null,null,null,null,null,null,null,null,null,"Fecha desde la cual deja de tener la calidad de ben. final o de existir la condición"]
[]
[null,{"$f":"+B2274+1","v":89},"Tipo Novedad"]
[null,{"$f":"+\"Beneficiario \"&B2300&\".\"","v":"Beneficiario 89."}]
[null,"Datos de los Beneficiarios Finales"]
[]
[null,"Nombre de la Empresa o Razón Social",null,null,null,null,null,null,null,null,null,null,null,null,null,null,null,null,null,null,null,null,null,null,null,null,null,null,null,null,null,null,null,null,null,null,null,null,null,null,null,null,null,null,null,null,null,null,"NIT - DV",null,null,null,null,null,null,null,null,null,null,"-"]
[]
[null,"Primer Nombre",null,null,null,null,null,null,null,null,null,null,null,null,"Otros Nombres",null,null,null,null,null,null,null,null,null,null,null,null,null,"Primer Apellido",null,null,null,null,null,null,null,null,null,null,null,null,null,null,null,null,"Segundo Apellido"]
[]
[null,"Tipo de Documento",null,null,null,null,null,null,null,null,null,null,null,null,"Número de identificación",null,null,null,null,null,null,null,null,null,null,null,null,null,"País de Expedición de Identificación"]
[]
[null,null,null,null,null,null,null,null,null,null,null,"Número de identificación Tributaria (NIT)",null,null,null,null,null,null,null,null,null,null,null,null,null,null,null,null,"País Expedición (NIT)"]
[]
[null,null,null,null,null,null,null,null,null,null,null,null,"Fecha de Nacimiento (PN)",null,null,null,null,null,null,null,null,null,null,null,null,null,null,null,"País de Nacimiento ",null,null,null,null,null,null,null,null,null,null,null,null,null,null,null,null,"País de Nacionalidad"]
[]
[null,"Dirección Residencia",null,null,null,null,null,null,null,null,null,null,null,null,null,null,null,null,null,"Departamento",null,null,null,null,null,null,null,null,null,null,null,null,null,null,"Municipio",null,null,null,null,null,null,null,null,null,"País de Residencia"]
[]
[null,null,null,null,null,null,null,null,null,null,null,null,null,null,null,null,null,null,null,"Código Postal",null,null,null,null,null,null,null,null,null,null,"Correo electrónico"]
[]
[null,"Beneficiario final de la estructura sin personería jurídica"]
[]
[null,"Fiduciante / Fideicomitente / Constituyente o posición similar o equivalente",null,null,null,null,null,null,null,null,null,null,null,null,null,null,"Comité financiero o posición similar o equivalente",null,null,null,null,null,null,null,null,null,null,null,null,"Fideicomisario / Beneficiario",null,null,null,null,null,null,null,null,null,null,"Ejerce control final y/o efectivo o tiene derecho a gozar y/o disponer de los activos, beneficios, resultados o utilidades"]
[]
[null,null,"Beneficiario Condicionado",null,null,null,null,null,null,null,{"$f":"+IF(AC2322=\"\",\"N\",\"S\")","v":"N"},null,null,null,null,"Condiciones que se deben cumplir para tener la calidad de beneficiario final - (Beneficiario Condicionado)"]
[]
[null,"Participación en el capital de la persona jurídica (%)",null,null,null,null,null,null,null,null,null,null,null,null,null,"Fecha desde la cual tiene la calidad de ben. final o existe la condición",null,null,null,null,null,null,null,null,null,null,null,null,null,null,null,null,null,"Fecha desde la cual deja de tener la calidad de ben. final o de existir la condición"]
[]
[null,{"$f":"+B2300+1","v":90},"Tipo Novedad"]
[null,{"$f":"+\"Beneficiario \"&B2326&\".\"","v":"Beneficiario 90."}]
[null,"Datos de los Beneficiarios Finales"]
[]
[null,"Nombre de la Empresa o Razón Social",null,null,null,null,null,null,null,null,null,null,null,null,null,null,null,null,null,null,null,null,null,null,null,null,null,null,null,null,null,null,null,null,null,null,null,null,null,null,null,null,null,null,null,null,null,null,"NIT - DV",null,null,null,null,null,null,null,null,null,null,"-"]
[]
[null,"Primer Nombre",null,null,null,null,null,null,null,null,null,null,null,null,"Otros Nombres",null,null,null,null,null,null,null,null,null,null,null,null,null,"Primer Apellido",null,null,null,null,null,null,null,null,null,null,null,null,null,null,null,null,"Segundo Apellido"]
[]
[null,"Tipo de Documento",null,null,null,null,null,null,null,null,null,null,null,null,"Número de identificación",null,null,null,null,null,null,null,null,null,null,null,null,null,"País de Expedición de Identificación"]
[]
[null,null,null,null,null,null,null,null,null,null,null,"Número de identificación Tributaria (NIT)",null,null,null,null,null,null,null,null,null,null,null,null,null,null,null,null,"País Expedición (NIT)"]
[]
[null,null,null,null,null,null,null,null,null,null,null,null,"Fecha de Nacimiento (PN)",null,null,null,null,null,null,null,null,null,null,null,null,null,null,null,"País de Nacimiento ",null,null,null,null,null,null,null,null,null,null,null,null,null,null,null,null,"País de Nacionalidad"]
[]
[null,"Dirección Residencia",null,null,null,null,null,null,null,null,null,null,null,null,null,null,null,null,null,"Departamento",null,null,null,null,null,null,null,null,null,null,null,null,null,null,"Municipio",null,null,null,null,null,null,null,null,null,"País de Residencia"]
[]
[null,null,null,null,null,null,null,null,null,null,null,null,null,null,null,null,null,null,null,"Código Postal",null,null,null,null,null,null,null,null,null,null,"Correo electrónico"]
[]
[null,"Beneficiario final de la estructura sin personería jurídica"]
[]
[null,"Fiduciante / Fideicomitente / Constituyente o posición similar o equivalente",null,null,null,null,null,null,null,null,null,null,null,null,null,null,"Comité financiero o posición similar o equivalente",null,null,null,null,null,null,null,null,null,null,null,null,"Fideicomisario / Beneficiario",null,null,null,null,null,null,null,null,null,null,"Ejerce control final y/o efectivo o tiene derecho a gozar y/o disponer de los activos, beneficios, resultados o utilidades"]
[]
[null,null,"Beneficiario Condicionado",null,null,null,null,null,null,null,{"$f":"+IF(AC2348=\"\",\"N\",\"S\")","v":"N"},null,null,null,null,"Condiciones que se deben cumplir para tener la calidad de beneficiario final - (Beneficiario Condicionado)"]
[]
[null,"Participación en el capital de la persona jurídica (%)",null,null,null,null,null,null,null,null,null,null,null,null,null,"Fecha desde la cual tiene la calidad de ben. final o existe la condición",null,null,null,null,null,null,null,null,null,null,null,null,null,null,null,null,null,"Fecha desde la cual deja de tener la calidad de ben. final o de existir la condición"]
[]
[null,{"$f":"+B2326+1","v":91},"Tipo Novedad"]
[null,{"$f":"+\"Beneficiario \"&B2352&\".\"","v":"Beneficiario 91."}]
[null,"Datos de los Beneficiarios Finales"]
[]
[null,"Nombre de la Empresa o Razón Social",null,null,null,null,null,null,null,null,null,null,null,null,null,null,null,null,null,null,null,null,null,null,null,null,null,null,null,null,null,null,null,null,null,null,null,null,null,null,null,null,null,null,null,null,null,null,"NIT - DV",null,null,null,null,null,null,null,null,null,null,"-"]
[]
[null,"Primer Nombre",null,null,null,null,null,null,null,null,null,null,null,null,"Otros Nombres",null,null,null,null,null,null,null,null,null,null,null,null,null,"Primer Apellido",null,null,null,null,null,null,null,null,null,null,null,null,null,null,null,null,"Segundo Apellido"]
[]
[null,"Tipo de Documento",null,null,null,null,null,null,null,null,null,null,null,null,"Número de identificación",null,null,null,null,null,null,null,null,null,null,null,null,null,"País de Expedición de Identificación"]
[]
[null,null,null,null,null,null,null,null,null,null,null,"Número de identificación Tributaria (NIT)",null,null,null,null,null,null,null,null,null,null,null,null,null,null,null,null,"País Expedición (NIT)"]
[]
[null,null,null,null,null,null,null,null,null,null,null,null,"Fecha de Nacimiento (PN)",null,null,null,null,null,null,null,null,null,null,null,null,null,null,null,"País de Nacimiento ",null,null,null,null,null,null,null,null,null,null,null,null,null,null,null,null,"País de Nacionalidad"]
[]
[null,"Dirección Residencia",null,null,null,null,null,null,null,null,null,null,null,null,null,null,null,null,null,"Departamento",null,null,null,null,null,null,null,null,null,null,null,null,null,null,"Municipio",null,null,null,null,null,null,null,null,null,"País de Residencia"]
[]
[null,null,null,null,null,null,null,null,null,null,null,null,null,null,null,null,null,null,null,"Código Postal",null,null,null,null,null,null,null,null,null,null,"Correo electrónico"]
[]
[null,"Beneficiario final de la estructura sin personería jurídica"]
[]
[null,"Fiduciante / Fideicomitente / Constituyente o posición similar o equivalente",null,null,null,null,null,null,null,null,null,null,null,null,null,null,"Comité financiero o posición similar o equivalente",null,null,null,null,null,null,null,null,null,null,null,null,"Fideicomisario / Beneficiario",null,null,null,null,null,null,null,null,null,null,"Ejerce control final y/o efectivo o tiene derecho a gozar y/o disponer de los activos, beneficios, resultados o utilidades"]
[]
[null,null,"Beneficiario Condicionado",null,null,null,null,null,null,null,{"$f":"+IF(AC2374=\"\",\"N\",\"S\")","v":"N"},null,null,null,null,"Condiciones que se deben cumplir para tener la calidad de beneficiario final - (Beneficiario Condicionado)"]
[]
[null,"Participación en el capital de la persona jurídica (%)",null,null,null,null,null,null,null,null,null,null,null,null,null,"Fecha desde la cual tiene la calidad de ben. final o existe la condición",null,null,null,null,null,null,null,null,null,null,null,null,null,null,null,null,null,"Fecha desde la cual deja de tener la calidad de ben. final o de existir la condición"]
[]
[null,{"$f":"+B2352+1","v":92},"Tipo Novedad"]
[null,{"$f":"+\"Beneficiario \"&B2378&\".\"","v":"Beneficiario 92."}]
[null,"Datos de los Beneficiarios Finales"]
[]
[null,"Nombre de la Empresa o Razón Social",null,null,null,null,null,null,null,null,null,null,null,null,null,null,null,null,null,null,null,null,null,null,null,null,null,null,null,null,null,null,null,null,null,null,null,null,null,null,null,null,null,null,null,null,null,null,"NIT - DV",null,null,null,null,null,null,null,null,null,null,"-"]
[]
[null,"Primer Nombre",null,null,null,null,null,null,null,null,null,null,null,null,"Otros Nombres",null,null,null,null,null,null,null,null,null,null,null,null,null,"Primer Apellido",null,null,null,null,null,null,null,null,null,null,null,null,null,null,null,null,"Segundo Apellido"]
[]
[null,"Tipo de Documento",null,null,null,null,null,null,null,null,null,null,null,null,"Número de identificación",null,null,null,null,null,null,null,null,null,null,null,null,null,"País de Expedición de Identificación"]
[]
[null,null,null,null,null,null,null,null,null,null,null,"Número de identificación Tributaria (NIT)",null,null,null,null,null,null,null,null,null,null,null,null,null,null,null,null,"País Expedición (NIT)"]
[]
[null,null,null,null,null,null,null,null,null,null,null,null,"Fecha de Nacimiento (PN)",null,null,null,null,null,null,null,null,null,null,null,null,null,null,null,"País de Nacimiento ",null,null,null,null,null,null,null,null,null,null,null,null,null,null,null,null,"País de Nacionalidad"]
[]
[null,"Dirección Residencia",null,null,null,null,null,null,null,null,null,null,null,null,null,null,null,null,null,"Departamento",null,null,null,null,null,null,null,null,null,null,null,null,null,null,"Municipio",null,null,null,null,null,null,null,null,null,"País de Residencia"]
[]
[null,null,null,null,null,null,null,null,null,null,null,null,null,null,null,null,null,null,null,"Código Postal",null,null,null,null,null,null,null,null,null,null,"Correo electrónico"]
[]
[null,"Beneficiario final de la estructura sin personería jurídica"]
[]
[null,"Fiduciante / Fideicomitente / Constituyente o posición similar o equivalente",null,null,null,null,null,null,null,null,null,null,null,null,null,null,"Comité financiero o posición similar o equivalente",null,null,null,null,null,null,null,null,null,null,null,null,"Fideicomisario / Beneficiario",null,null,null,null,null,null,null,null,null,null,"Ejerce control final y/o efectivo o tiene derecho a gozar y/o disponer de los activos, beneficios, resultados o utilidades"]
[]
[null,null,"Beneficiario Condicionado",null,null,null,null,null,null,null,{"$f":"+IF(AC2400=\"\",\"N\",\"S\")","v":"N"},null,null,null,null,"Condiciones que se deben cumplir para tener la calidad de beneficiario final - (Beneficiario Condicionado)"]
[]
[null,"Participación en el capital de la persona jurídica (%)",null,null,null,null,null,null,null,null,null,null,null,null,null,"Fecha desde la cual tiene la calidad de ben. final o existe la condición",null,null,null,null,null,null,null,null,null,null,null,null,null,null,null,null,null,"Fecha desde la cual deja de tener la calidad de ben. final o de existir la condición"]
[]
[null,{"$f":"+B2378+1","v":93},"Tipo Novedad"]
[null,{"$f":"+\"Beneficiario \"&B2404&\".\"","v":"Beneficiario 93."}]
[null,"Datos de los Beneficiarios Finales"]
[]
[null,"Nombre de la Empresa o Razón Social",null,null,null,null,null,null,null,null,null,null,null,null,null,null,null,null,null,null,null,null,null,null,null,null,null,null,null,null,null,null,null,null,null,null,null,null,null,null,null,null,null,null,null,null,null,null,"NIT - DV",null,null,null,null,null,null,null,null,null,null,"-"]
[]
[null,"Primer Nombre",null,null,null,null,null,null,null,null,null,null,null,null,"Otros Nombres",null,null,null,null,null,null,null,null,null,null,null,null,null,"Primer Apellido",null,null,null,null,null,null,null,null,null,null,null,null,null,null,null,null,"Segundo Apellido"]
[]
[null,"Tipo de Documento",null,null,null,null,null,null,null,null,null,null,null,null,"Número de identificación",null,null,null,null,null,null,null,null,null,null,null,null,null,"País de Expedición de Identificación"]
[]
[null,null,null,null,null,null,null,null,null,null,null,"Número de identificación Tributaria (NIT)",null,null,null,null,null,null,null,null,null,null,null,null,null,null,null,null,"País Expedición (NIT)"]
[]
[null,null,null,null,null,null,null,null,null,null,null,null,"Fecha de Nacimiento (PN)",null,null,null,null,null,null,null,null,null,null,null,null,null,null,null,"País de Nacimiento ",null,null,null,null,null,null,null,null,null,null,null,null,null,null,null,null,"País de Nacionalidad"]
[]
[null,"Dirección Residencia",null,null,null,null,null,null,null,null,null,null,null,null,null,null,null,null,null,"Departamento",null,null,null,null,null,null,null,null,null,null,null,null,null,null,"Municipio",null,null,null,null,null,null,null,null,null,"País de Residencia"]
[]
[null,null,null,null,null,null,null,null,null,null,null,null,null,null,null,null,null,null,null,"Código Postal",null,null,null,null,null,null,null,null,null,null,"Correo electrónico"]
[]
[null,"Beneficiario final de la estructura sin personería jurídica"]
[]
[null,"Fiduciante / Fideicomitente / Constituyente o posición similar o equivalente",null,null,null,null,null,null,null,null,null,null,null,null,null,null,"Comité financiero o posición similar o equivalente",null,null,null,null,null,null,null,null,null,null,null,null,"Fideicomisario / Beneficiario",null,null,null,null,null,null,null,null,null,null,"Ejerce control final y/o efectivo o tiene derecho a gozar y/o disponer de los activos, beneficios, resultados o utilidades"]
[]
[null,null,"Beneficiario Condicionado",null,null,null,null,null,null,null,{"$f":"+IF(AC2426=\"\",\"N\",\"S\")","v":"N"},null,null,null,null,"Condiciones que se deben cumplir para tener la calidad de beneficiario final - (Beneficiario Condicionado)"]
[]
[null,"Participación en el capital de la persona jurídica (%)",null,null,null,null,null,null,null,null,null,null,null,null,null,"Fecha desde la cual tiene la calidad de ben. final o existe la condición",null,null,null,null,null,null,null,null,null,null,null,null,null,null,null,null,null,"Fecha desde la cual deja de tener la calidad de ben. final o de existir la condición"]
[]
[null,{"$f":"+B2404+1","v":94},"Tipo Novedad"]
[null,{"$f":"+\"Beneficiario \"&B2430&\".\"","v":"Beneficiario 94."}]
[null,"Datos de los Beneficiarios Finales"]
[]
[null,"Nombre de la Empresa o Razón Social",null,null,null,null,null,null,null,null,null,null,null,null,null,null,null,null,null,null,null,null,null,null,null,null,null,null,null,null,null,null,null,null,null,null,null,null,null,null,null,null,null,null,null,null,null,null,"NIT - DV",null,null,null,null,null,null,null,null,null,null,"-"]
[]
[null,"Primer Nombre",null,null,null,null,null,null,null,null,null,null,null,null,"Otros Nombres",null,null,null,null,null,null,null,null,null,null,null,null,null,"Primer Apellido",null,null,null,null,null,null,null,null,null,null,null,null,null,null,null,null,"Segundo Apellido"]
[]
[null,"Tipo de Documento",null,null,null,null,null,null,null,null,null,null,null,null,"Número de identificación",null,null,null,null,null,null,null,null,null,null,null,null,null,"País de Expedición de Identificación"]
[]
[null,null,null,null,null,null,null,null,null,null,null,"Número de identificación Tributaria (NIT)",null,null,null,null,null,null,null,null,null,null,null,null,null,null,null,null,"País Expedición (NIT)"]
[]
[null,null,null,null,null,null,null,null,null,null,null,null,"Fecha de Nacimiento (PN)",null,null,null,null,null,null,null,null,null,null,null,null,null,null,null,"País de Nacimiento ",null,null,null,null,null,null,null,null,null,null,null,null,null,null,null,null,"País de Nacionalidad"]
[]
[null,"Dirección Residencia",null,null,null,null,null,null,null,null,null,null,null,null,null,null,null,null,null,"Departamento",null,null,null,null,null,null,null,null,null,null,null,null,null,null,"Municipio",null,null,null,null,null,null,null,null,null,"País de Residencia"]
[]
[null,null,null,null,null,null,null,null,null,null,null,null,null,null,null,null,null,null,null,"Código Postal",null,null,null,null,null,null,null,null,null,null,"Correo electrónico"]
[]
[null,"Beneficiario final de la estructura sin personería jurídica"]
[]
[null,"Fiduciante / Fideicomitente / Constituyente o posición similar o equivalente",null,null,null,null,null,null,null,null,null,null,null,null,null,null,"Comité financiero o posición similar o equivalente",null,null,null,null,null,null,null,null,null,null,null,null,"Fideicomisario / Beneficiario",null,null,null,null,null,null,null,null,null,null,"Ejerce control final y/o efectivo o tiene derecho a gozar y/o disponer de los activos, beneficios, resultados o utilidades"]
[]
[null,null,"Beneficiario Condicionado",null,null,null,null,null,null,null,{"$f":"+IF(AC2452=\"\",\"N\",\"S\")","v":"N"},null,null,null,null,"Condiciones que se deben cumplir para tener la calidad de beneficiario final - (Beneficiario Condicionado)"]
[]
[null,"Participación en el capital de la persona jurídica (%)",null,null,null,null,null,null,null,null,null,null,null,null,null,"Fecha desde la cual tiene la calidad de ben. final o existe la condición",null,null,null,null,null,null,null,null,null,null,null,null,null,null,null,null,null,"Fecha desde la cual deja de tener la calidad de ben. final o de existir la condición"]
[]
[null,{"$f":"+B2430+1","v":95},"Tipo Novedad"]
[null,{"$f":"+\"Beneficiario \"&B2456&\".\"","v":"Beneficiario 95."}]
[null,"Datos de los Beneficiarios Finales"]
[]
[null,"Nombre de la Empresa o Razón Social",null,null,null,null,null,null,null,null,null,null,null,null,null,null,null,null,null,null,null,null,null,null,null,null,null,null,null,null,null,null,null,null,null,null,null,null,null,null,null,null,null,null,null,null,null,null,"NIT - DV",null,null,null,null,null,null,null,null,null,null,"-"]
[]
[null,"Primer Nombre",null,null,null,null,null,null,null,null,null,null,null,null,"Otros Nombres",null,null,null,null,null,null,null,null,null,null,null,null,null,"Primer Apellido",null,null,null,null,null,null,null,null,null,null,null,null,null,null,null,null,"Segundo Apellido"]
[]
[null,"Tipo de Documento",null,null,null,null,null,null,null,null,null,null,null,null,"Número de identificación",null,null,null,null,null,null,null,null,null,null,null,null,null,"País de Expedición de Identificación"]
[]
[null,null,null,null,null,null,null,null,null,null,null,"Número de identificación Tributaria (NIT)",null,null,null,null,null,null,null,null,null,null,null,null,null,null,null,null,"País Expedición (NIT)"]
[]
[null,null,null,null,null,null,null,null,null,null,null,null,"Fecha de Nacimiento (PN)",null,null,null,null,null,null,null,null,null,null,null,null,null,null,null,"País de Nacimiento ",null,null,null,null,null,null,null,null,null,null,null,null,null,null,null,null,"País de Nacionalidad"]
[]
[null,"Dirección Residencia",null,null,null,null,null,null,null,null,null,null,null,null,null,null,null,null,null,"Departamento",null,null,null,null,null,null,null,null,null,null,null,null,null,null,"Municipio",null,null,null,null,null,null,null,null,null,"País de Residencia"]
[]
[null,null,null,null,null,null,null,null,null,null,null,null,null,null,null,null,null,null,null,"Código Postal",null,null,null,null,null,null,null,null,null,null,"Correo electrónico"]
[]
[null,"Beneficiario final de la estructura sin personería jurídica"]
[]
[null,"Fiduciante / Fideicomitente / Constituyente o posición similar o equivalente",null,null,null,null,null,null,null,null,null,null,null,null,null,null,"Comité financiero o posición similar o equivalente",null,null,null,null,null,null,null,null,null,null,null,null,"Fideicomisario / Beneficiario",null,null,null,null,null,null,null,null,null,null,"Ejerce control final y/o efectivo o tiene derecho a gozar y/o disponer de los activos, beneficios, resultados o utilidades"]
[]
[null,null,"Beneficiario Condicionado",null,null,null,null,null,null,null,{"$f":"+IF(AC2478=\"\",\"N\",\"S\")","v":"N"},null,null,null,null,"Condiciones que se deben cumplir para tener la calidad de beneficiario final - (Beneficiario Condicionado)"]
[]
[null,"Participación en el capital de la persona jurídica (%)",null,null,null,null,null,null,null,null,null,null,null,null,null,"Fecha desde la cual tiene la calidad de ben. final o existe la condición",null,null,null,null,null,null,null,null,null,null,null,null,null,null,null,null,null,"Fecha desde la cual deja de tener la calidad de ben. final o de existir la condición"]
[]
[null,{"$f":"+B2456+1","v":96},"Tipo Novedad"]
[null,{"$f":"+\"Beneficiario \"&B2482&\".\"","v":"Beneficiario 96."}]
[null,"Datos de los Beneficiarios Finales"]
[]
[null,"Nombre de la Empresa o Razón Social",null,null,null,null,null,null,null,null,null,null,null,null,null,null,null,null,null,null,null,null,null,null,null,null,null,null,null,null,null,null,null,null,null,null,null,null,null,null,null,null,null,null,null,null,null,null,"NIT - DV",null,null,null,null,null,null,null,null,null,null,"-"]
[]
[null,"Primer Nombre",null,null,null,null,null,null,null,null,null,null,null,null,"Otros Nombres",null,null,null,null,null,null,null,null,null,null,null,null,null,"Primer Apellido",null,null,null,null,null,null,null,null,null,null,null,null,null,null,null,null,"Segundo Apellido"]
[]
[null,"Tipo de Documento",null,null,null,null,null,null,null,null,null,null,null,null,"Número de identificación",null,null,null,null,null,null,null,null,null,null,null,null,null,"País de Expedición de Identificación"]
[]
[null,null,null,null,null,null,null,null,null,null,null,"Número de identificación Tributaria (NIT)",null,null,null,null,null,null,null,null,null,null,null,null,null,null,null,null,"País Expedición (NIT)"]
[]
[null,null,null,null,null,null,null,null,null,null,null,null,"Fecha de Nacimiento (PN)",null,null,null,null,null,null,null,null,null,null,null,null,null,null,null,"País de Nacimiento ",null,null,null,null,null,null,null,null,null,null,null,null,null,null,null,null,"País de Nacionalidad"]
[]
[null,"Dirección Residencia",null,null,null,null,null,null,null,null,null,null,null,null,null,null,null,null,null,"Departamento",null,null,null,null,null,null,null,null,null,null,null,null,null,null,"Municipio",null,null,null,null,null,null,null,null,null,"País de Residencia"]
[]
[null,null,null,null,null,null,null,null,null,null,null,null,null,null,null,null,null,null,null,"Código Postal",null,null,null,null,null,null,null,null,null,null,"Correo electrónico"]
[]
[null,"Beneficiario final de la estructura sin personería jurídica"]
[]
[null,"Fiduciante / Fideicomitente / Constituyente o posición similar o equivalente",null,null,null,null,null,null,null,null,null,null,null,null,null,null,"Comité financiero o posición similar o equivalente",null,null,null,null,null,null,null,null,null,null,null,null,"Fideicomisario / Beneficiario",null,null,null,null,null,null,null,null,null,null,"Ejerce control final y/o efectivo o tiene derecho a gozar y/o disponer de los activos, beneficios, resultados o utilidades"]
[]
[null,null,"Beneficiario Condicionado",null,null,null,null,null,null,null,{"$f":"+IF(AC2504=\"\",\"N\",\"S\")","v":"N"},null,null,null,null,"Condiciones que se deben cumplir para tener la calidad de beneficiario final - (Beneficiario Condicionado)"]
[]
[null,"Participación en el capital de la persona jurídica (%)",null,null,null,null,null,null,null,null,null,null,null,null,null,"Fecha desde la cual tiene la calidad de ben. final o existe la condición",null,null,null,null,null,null,null,null,null,null,null,null,null,null,null,null,null,"Fecha desde la cual deja de tener la calidad de ben. final o de existir la condición"]
[]
[null,{"$f":"+B2482+1","v":97},"Tipo Novedad"]
[null,{"$f":"+\"Beneficiario \"&B2508&\".\"","v":"Beneficiario 97."}]
[null,"Datos de los Beneficiarios Finales"]
[]
[null,"Nombre de la Empresa o Razón Social",null,null,null,null,null,null,null,null,null,null,null,null,null,null,null,null,null,null,null,null,null,null,null,null,null,null,null,null,null,null,null,null,null,null,null,null,null,null,null,null,null,null,null,null,null,null,"NIT - DV",null,null,null,null,null,null,null,null,null,null,"-"]
[]
[null,"Primer Nombre",null,null,null,null,null,null,null,null,null,null,null,null,"Otros Nombres",null,null,null,null,null,null,null,null,null,null,null,null,null,"Primer Apellido",null,null,null,null,null,null,null,null,null,null,null,null,null,null,null,null,"Segundo Apellido"]
[]
[null,"Tipo de Documento",null,null,null,null,null,null,null,null,null,null,null,null,"Número de identificación",null,null,null,null,null,null,null,null,null,null,null,null,null,"País de Expedición de Identificación"]
[]
[null,null,null,null,null,null,null,null,null,null,null,"Número de identificación Tributaria (NIT)",null,null,null,null,null,null,null,null,null,null,null,null,null,null,null,null,"País Expedición (NIT)"]
[]
[null,null,null,null,null,null,null,null,null,null,null,null,"Fecha de Nacimiento (PN)",null,null,null,null,null,null,null,null,null,null,null,null,null,null,null,"País de Nacimiento ",null,null,null,null,null,null,null,null,null,null,null,null,null,null,null,null,"País de Nacionalidad"]
[]
[null,"Dirección Residencia",null,null,null,null,null,null,null,null,null,null,null,null,null,null,null,null,null,"Departamento",null,null,null,null,null,null,null,null,null,null,null,null,null,null,"Municipio",null,null,null,null,null,null,null,null,null,"País de Residencia"]
[]
[null,null,null,null,null,null,null,null,null,null,null,null,null,null,null,null,null,null,null,"Código Postal",null,null,null,null,null,null,null,null,null,null,"Correo electrónico"]
[]
[null,"Beneficiario final de la estructura sin personería jurídica"]
[]
[null,"Fiduciante / Fideicomitente / Constituyente o posición similar o equivalente",null,null,null,null,null,null,null,null,null,null,null,null,null,null,"Comité financiero o posición similar o equivalente",null,null,null,null,null,null,null,null,null,null,null,null,"Fideicomisario / Beneficiario",null,null,null,null,null,null,null,null,null,null,"Ejerce control final y/o efectivo o tiene derecho a gozar y/o disponer de los activos, beneficios, resultados o utilidades"]
[]
[null,null,"Beneficiario Condicionado",null,null,null,null,null,null,null,{"$f":"+IF(AC2530=\"\",\"N\",\"S\")","v":"N"},null,null,null,null,"Condiciones que se deben cumplir para tener la calidad de beneficiario final - (Beneficiario Condicionado)"]
[]
[null,"Participación en el capital de la persona jurídica (%)",null,null,null,null,null,null,null,null,null,null,null,null,null,"Fecha desde la cual tiene la calidad de ben. final o existe la condición",null,null,null,null,null,null,null,null,null,null,null,null,null,null,null,null,null,"Fecha desde la cual deja de tener la calidad de ben. final o de existir la condición"]
[]
[null,{"$f":"+B2508+1","v":98},"Tipo Novedad"]
[null,{"$f":"+\"Beneficiario \"&B2534&\".\"","v":"Beneficiario 98."}]
[null,"Datos de los Beneficiarios Finales"]
[]
[null,"Nombre de la Empresa o Razón Social",null,null,null,null,null,null,null,null,null,null,null,null,null,null,null,null,null,null,null,null,null,null,null,null,null,null,null,null,null,null,null,null,null,null,null,null,null,null,null,null,null,null,null,null,null,null,"NIT - DV",null,null,null,null,null,null,null,null,null,null,"-"]
[]
[null,"Primer Nombre",null,null,null,null,null,null,null,null,null,null,null,null,"Otros Nombres",null,null,null,null,null,null,null,null,null,null,null,null,null,"Primer Apellido",null,null,null,null,null,null,null,null,null,null,null,null,null,null,null,null,"Segundo Apellido"]
[]
[null,"Tipo de Documento",null,null,null,null,null,null,null,null,null,null,null,null,"Número de identificación",null,null,null,null,null,null,null,null,null,null,null,null,null,"País de Expedición de Identificación"]
[]
[null,null,null,null,null,null,null,null,null,null,null,"Número de identificación Tributaria (NIT)",null,null,null,null,null,null,null,null,null,null,null,null,null,null,null,null,"País Expedición (NIT)"]
[]
[null,null,null,null,null,null,null,null,null,null,null,null,"Fecha de Nacimiento (PN)",null,null,null,null,null,null,null,null,null,null,null,null,null,null,null,"País de Nacimiento ",null,null,null,null,null,null,null,null,null,null,null,null,null,null,null,null,"País de Nacionalidad"]
[]
[null,"Dirección Residencia",null,null,null,null,null,null,null,null,null,null,null,null,null,null,null,null,null,"Departamento",null,null,null,null,null,null,null,null,null,null,null,null,null,null,"Municipio",null,null,null,null,null,null,null,null,null,"País de Residencia"]
[]
[null,null,null,null,null,null,null,null,null,null,null,null,null,null,null,null,null,null,null,"Código Postal",null,null,null,null,null,null,null,null,null,null,"Correo electrónico"]
[]
[null,"Beneficiario final de la estructura sin personería jurídica"]
[]
[null,"Fiduciante / Fideicomitente / Constituyente o posición similar o equivalente",null,null,null,null,null,null,null,null,null,null,null,null,null,null,"Comité financiero o posición similar o equivalente",null,null,null,null,null,null,null,null,null,null,null,null,"Fideicomisario / Beneficiario",null,null,null,null,null,null,null,null,null,null,"Ejerce control final y/o efectivo o tiene derecho a gozar y/o disponer de los activos, beneficios, resultados o utilidades"]
[]
[null,null,"Beneficiario Condicionado",null,null,null,null,null,null,null,{"$f":"+IF(AC2556=\"\",\"N\",\"S\")","v":"N"},null,null,null,null,"Condiciones que se deben cumplir para tener la calidad de beneficiario final - (Beneficiario Condicionado)"]
[]
[null,"Participación en el capital de la persona jurídica (%)",null,null,null,null,null,null,null,null,null,null,null,null,null,"Fecha desde la cual tiene la calidad de ben. final o existe la condición",null,null,null,null,null,null,null,null,null,null,null,null,null,null,null,null,null,"Fecha desde la cual deja de tener la calidad de ben. final o de existir la condición"]
[]
[null,{"$f":"+B2534+1","v":99},"Tipo Novedad"]
[null,{"$f":"+\"Beneficiario \"&B2560&\".\"","v":"Beneficiario 99."}]
[null,"Datos de los Beneficiarios Finales"]
[]
[null,"Nombre de la Empresa o Razón Social",null,null,null,null,null,null,null,null,null,null,null,null,null,null,null,null,null,null,null,null,null,null,null,null,null,null,null,null,null,null,null,null,null,null,null,null,null,null,null,null,null,null,null,null,null,null,"NIT - DV",null,null,null,null,null,null,null,null,null,null,"-"]
[]
[null,"Primer Nombre",null,null,null,null,null,null,null,null,null,null,null,null,"Otros Nombres",null,null,null,null,null,null,null,null,null,null,null,null,null,"Primer Apellido",null,null,null,null,null,null,null,null,null,null,null,null,null,null,null,null,"Segundo Apellido"]
[]
[null,"Tipo de Documento",null,null,null,null,null,null,null,null,null,null,null,null,"Número de identificación",null,null,null,null,null,null,null,null,null,null,null,null,null,"País de Expedición de Identificación"]
[]
[null,null,null,null,null,null,null,null,null,null,null,"Número de identificación Tributaria (NIT)",null,null,null,null,null,null,null,null,null,null,null,null,null,null,null,null,"País Expedición (NIT)"]
[]
[null,null,null,null,null,null,null,null,null,null,null,null,"Fecha de Nacimiento (PN)",null,null,null,null,null,null,null,null,null,null,null,null,null,null,null,"País de Nacimiento ",null,null,null,null,null,null,null,null,null,null,null,null,null,null,null,null,"País de Nacionalidad"]
[]
[null,"Dirección Residencia",null,null,null,null,null,null,null,null,null,null,null,null,null,null,null,null,null,"Departamento",null,null,null,null,null,null,null,null,null,null,null,null,null,null,"Municipio",null,null,null,null,null,null,null,null,null,"País de Residencia"]
[]
[null,null,null,null,null,null,null,null,null,null,null,null,null,null,null,null,null,null,null,"Código Postal",null,null,null,null,null,null,null,null,null,null,"Correo electrónico"]
[]
[null,"Beneficiario final de la estructura sin personería jurídica"]
[]
[null,"Fiduciante / Fideicomitente / Constituyente o posición similar o equivalente",null,null,null,null,null,null,null,null,null,null,null,null,null,null,"Comité financiero o posición similar o equivalente",null,null,null,null,null,null,null,null,null,null,null,null,"Fideicomisario / Beneficiario",null,null,null,null,null,null,null,null,null,null,"Ejerce control final y/o efectivo o tiene derecho a gozar y/o disponer de los activos, beneficios, resultados o utilidades"]
[]
[null,null,"Beneficiario Condicionado",null,null,null,null,null,null,null,{"$f":"+IF(AC2582=\"\",\"N\",\"S\")","v":"N"},null,null,null,null,"Condiciones que se deben cumplir para tener la calidad de beneficiario final - (Beneficiario Condicionado)"]
[]
[null,"Participación en el capital de la persona jurídica (%)",null,null,null,null,null,null,null,null,null,null,null,null,null,"Fecha desde la cual tiene la calidad de ben. final o existe la condición",null,null,null,null,null,null,null,null,null,null,null,null,null,null,null,null,null,"Fecha desde la cual deja de tener la calidad de ben. final o de existir la condición"]
[]
[null,{"$f":"+B2560+1","v":100},"Tipo Novedad"]
[null,{"$f":"+\"Beneficiario \"&B2586&\".\"","v":"Beneficiario 100."}]
[null,"Datos de los Beneficiarios Finales"]
[]
[null,"Nombre de la Empresa o Razón Social",null,null,null,null,null,null,null,null,null,null,null,null,null,null,null,null,null,null,null,null,null,null,null,null,null,null,null,null,null,null,null,null,null,null,null,null,null,null,null,null,null,null,null,null,null,null,"NIT - DV",null,null,null,null,null,null,null,null,null,null,"-"]
[]
[null,"Primer Nombre",null,null,null,null,null,null,null,null,null,null,null,null,"Otros Nombres",null,null,null,null,null,null,null,null,null,null,null,null,null,"Primer Apellido",null,null,null,null,null,null,null,null,null,null,null,null,null,null,null,null,"Segundo Apellido"]
[]
[null,"Tipo de Documento",null,null,null,null,null,null,null,null,null,null,null,null,"Número de identificación",null,null,null,null,null,null,null,null,null,null,null,null,null,"País de Expedición de Identificación"]
[]
[null,null,null,null,null,null,null,null,null,null,null,"Número de identificación Tributaria (NIT)",null,null,null,null,null,null,null,null,null,null,null,null,null,null,null,null,"País Expedición (NIT)"]
[]
[null,null,null,null,null,null,null,null,null,null,null,null,"Fecha de Nacimiento (PN)",null,null,null,null,null,null,null,null,null,null,null,null,null,null,null,"País de Nacimiento ",null,null,null,null,null,null,null,null,null,null,null,null,null,null,null,null,"País de Nacionalidad"]
[]
[null,"Dirección Residencia",null,null,null,null,null,null,null,null,null,null,null,null,null,null,null,null,null,"Departamento",null,null,null,null,null,null,null,null,null,null,null,null,null,null,"Municipio",null,null,null,null,null,null,null,null,null,"País de Residencia"]
[]
[null,null,null,null,null,null,null,null,null,null,null,null,null,null,null,null,null,null,null,"Código Postal",null,null,null,null,null,null,null,null,null,null,"Correo electrónico"]
[]
[null,"Beneficiario final de la estructura sin personería jurídica"]
[]
[null,"Fiduciante / Fideicomitente / Constituyente o posición similar o equivalente",null,null,null,null,null,null,null,null,null,null,null,null,null,null,"Comité financiero o posición similar o equivalente",null,null,null,null,null,null,null,null,null,null,null,null,"Fideicomisario / Beneficiario",null,null,null,null,null,null,null,null,null,null,"Ejerce control final y/o efectivo o tiene derecho a gozar y/o disponer de los activos, beneficios, resultados o utilidades"]
[]
[null,null,"Beneficiario Condicionado",null,null,null,null,null,null,null,{"$f":"+IF(AC2608=\"\",\"N\",\"S\")","v":"N"},null,null,null,null,"Condiciones que se deben cumplir para tener la calidad de beneficiario final - (Beneficiario Condicionado)"]
[]
[null,"Participación en el capital de la persona jurídica (%)",null,null,null,null,null,null,null,null,null,null,null,null,null,"Fecha desde la cual tiene la calidad de ben. final o existe la condición",null,null,null,null,null,null,null,null,null,null,null,null,null,null,null,null,null,"Fecha desde la cual deja de tener la calidad de ben. final o de existir la condición"]
[]
[null,{"$f":"+B2586+1","v":101},"Tipo Novedad"]
[]
[]
[]
[null,"Firma"]
[]
[null,"Nombre",null,null,null,null,null,null,null,{"$f":"+IF(Formato!$C$14=\"\",\"\",Formato!$C$14)","v":""}]
[]
[null,"Número de identificación",null,null,null,null,null,null,null,{"$f":"+IF(Formato!$G$14=\"\",\"\",Formato!$G$14)","v":""}]
[]
[null,"Actuando en calidad de",null,null,null,null,null,null,null,{"$f":"+IF(Formato!$J$14=\"\",\"\",Formato!$J$14)","v":""}]
[]
[null,"Cual",null,null,null,null,null,null,null,{"$f":"+IF(Formato!$L$14=\"\",\"\",Formato!$L$14)","v":""}]
[]
[null,"NOTA: Tenga en cuenta que:\n1. Si la cantidad de beneficiarios finales supera los registrados en este documento, debe imprimir un nuevo formato indicando en el encabezado que corresponde a la continuación del diligenciado inicialmente.\n2. Ante cualquier modificación de la información aquí suministrada, debe efectuar su respectiva actualización mediante el diligenciamiento de un nuevo formato. "]

{"sheet":"listas","index":2,"n_rows":1120,"n_cols":53,"rows_kept":1120,"cut":false,"hidden":true,"merged":[]}
[null,"Tipo de Doc","Titularidad",null,"Beneficio",null,null,"AÑO-dilig",null,"AÑO","MES","DIA",null,"Tipo documento","id",null,null,"DEPARTAMENTO",null,null,null,"Nombre Municipio","Cod Municipio","Código Dpto","Nombre Departamento",null,null,"Ciudad oficinas gnb",null,"paises","pais original","DESCISION","codigo pais dian",null,null,null,null,null,"Tipo Producto",null,"-",null,null,"Tipo Novedad",null,null,null,"fecha Nacimiento ini","fecha Nacimiento Fin","Fecha Inicial condiciones","Fecha Final condiciones",null,"Actuando en calidad:"]
[null,"-","1. Capital",1,"1. Activos",1,null,2022,null,1930,"01","01",null," Cédula de ciudadanía",13,null,null,"Nombre","Código",null,null,"BOGOTA",1,11,"BOGOTA",null,null,"ARMENIA",null,"COLOMBIA","COLOMBIA","S",169,3,169,null,null,null,"Patrimonio Autónomo",null,"Si","S",null,"Reporte Inicial.",1,null,null,"1910-01-01",{"$f":"+TODAY()","v":"2023-09-06"},{"$f":"+TODAY()","v":"2023-09-06"},{"$f":"+TODAY()+(365*100)","v":"2123-08-13"},null,"A título propio"]
[1,"CC","2. Derechos de voto",2,"2. Rendimientos",2,null,2023,null,1931,"02","02",null," Cédula de extranjería",22,null,null,"BOGOTÁ",11,null,null,"ABEJORRAL",2,5,"ANTIOQUIA",null,null,"BARRANQUILLA",null,"AFGANISTAN","AFGANISTAN","N","013",3,"013",null,null,null,"Fondo de Inversion Colectiva - FIC",null,"No","N",null,"Actualización.",2,null,null,null,null,null,null,null,"Representante Legal"]
[2,"TI","3. Capital y Derechos de Voto",3,"3. Utilidades",3,null,2024,null,1932,"03","03",null," Pasaporte",41,null,null,"AMAZONAS",91,null,null,"ABREGO",3,54,"NORTE DE SANTANDER",null,null,"BOGOTA",null,"ALBANIA","ALBANIA",null,"017",3,"017",null,null,null,"Fondo Voluntario de Pensiones - FVP",null,null,null,null,"Terminación.",3,null,null,null,null,null,null,null,"Representante común"]
[3,"CE","4. No aplica",4,"4. Activos y rendimientos",4,null,2025,null,1933,"04","04",null," Permiso Especial de Permanencia",47,null,null,"ANTIOQUIA",5,null,null,"ABRIAQUI",4,5,"ANTIOQUIA",null,null,"BUCARAMANGA",null,"ALEMANIA","ALEMANIA",null,"023",3,"023",null,null,null,null,null,null,null,null,null,null,null,null,null,null,null,null,null,"Otro"]
[4,"NIT NAT",null,null,"5. Activos y utilidades",5,null,2026,null,1934,"05","05",null," Registro civil de nacimiento",11,null,null,"ARAUCA",81,null,null,"ACACIAS",6,50,"META",null,null,"BUENAVENTURA",null,"ANDORRA","ANDORRA",null,"037",3,"037"]
[5,"NIT JUR",null,null,"6. Rendimientos y utilidades",6,null,2027,null,1935,"06","06",null," Tarjeta de extranjería",21,null,null,"ATLÁNTICO",8,null,null,"ACANDI",6,27,"CHOCO",null,null,"CALI",null,"ANGOLA","ANGOLA",null,"040",3,"040"]
[6,"PATR AUT",null,null,"7. Activos, rendimientos y utilidades",7,null,2028,null,1936,"07","07",null," Tarjeta de identidad",12,null,null,"BOLÍVAR",13,null,null,"ACEVEDO",6,41,"HUILA",null,null,"CARTAGENA",null,"ANGUILLA","ANGUILLA",null,"041",3,"041"]
[7,"PAS.",null,null,"8. No aplica",8,null,2029,null,1937,"08","08",null,"Tipo documento extranjero",42,null,null,"BOYACÁ",15,null,null,"ACHI",6,13,"BOLIVAR",null,null,"CUCUTA",null,"ANTIGUA Y BARBUDA","ANTIGUA Y BARBUDA",null,"043",3,"043"]
[9,"NIT EXT",null,null,null,null,null,2030,null,1938,"09","09",null,null,null,null,null,"CALDAS",17,null,null,"AGRADO",13,41,"HUILA",null,null,"ENVIGADO",null,"ANTILLAS HOLANDESAS","ANTILLAS HOLANDESAS",null,"047",3,"047"]
[10,"RC",null,null,null,null,null,null,null,1939,"10","10",null,null,null,null,null,"CAQUETÁ",18,null,null,"AGUA DE DIOS",1,25,"CUNDINAMARCA",null,null,"FLORIDABLANCA",null,"ARABIA SAUDITA","ARABIA SAUDITA",null,"053",3,"053"]
[12,"CAR DIP",null,null,null,null,null,null,null,1940,"11","11",null,null,null,null,null,"CASANARE",85,null,null,"AGUACHICA",11,20,"CESAR",null,null,"FUNZA",null,"ARGELIA","ARGELIA",null,"059",3,"059"]
[null,null,null,null,null,null,null,null,null,1941,"12","12",null,null,null,null,null,"CAUCA",19,null,null,"AGUADA",13,68,"SANTANDER",null,null,"GIRON",null,"ARGENTINA","ARGENTINA",null,"063",3,"063"]
[null,null,null,null,null,null,null,null,null,1942,null,"13",null,null,null,null,null,"CESAR",20,null,null,"AGUADAS",13,17,"CALDAS",null,null,"IBAGUE",null,"ARMENIA","ARMENIA",null,"026",3,"026"]
[null,null,null,null,null,null,null,null,null,1943,null,"14",null,null,null,null,null,"CHOCÓ",27,null,null,"AGUAZUL",10,85,"CASANARE",null,null,"ITAGUI",null,"ARUBA","ARUBA",null,"027",3,"027"]
[null,null,null,null,null,null,null,null,null,1944,null,"15",null,null,null,null,null,"CÓRDOBA",23,null,null,"AGUSTIN CODAZZI",13,20,"CESAR",null,null,"MALAMBO",null,"AUSTRALIA","AUSTRALIA",null,"069",3,"069"]
[null,null,null,null,null,null,null,null,null,1945,null,"16",null,null,null,null,null,"CUNDINAMARCA",25,null,null,"AIPE",16,41,"HUILA",null,null,"MANIZALES",null,"AUSTRIA","AUSTRIA",null,"072",3,"072"]
[null,null,null,null,null,null,null,null,null,1946,null,"17",null,null,null,null,null,"GUAINÍA",94,null,null,"ALBAN",19,25,"CUNDINAMARCA",null,null,"MEDELLIN",null,"AZERBAIJAN","AZERBAIJAN",null,"074",3,"074"]
[null,null,null,null,null,null,null,null,null,1947,null,"18",null,null,null,null,null,"GUAVIARE",95,null,null,"ALBAN",19,52,"NARIÑO",null,null,"MONTERIA",null,"BAHAMAS","BAHAMAS",null,"077",3,"077"]
[null,null,null,null,null,null,null,null,null,1948,null,"19",null,null,null,null,null,"HUILA",41,null,null,"ALBANIA",29,18,"CAQUETA",null,null,"NEIVA",null,"BAHREIN","BAHREIN",null,"080",3,"080"]
[null,null,null,null,null,null,null,null,null,1949,null,"20",null,null,null,null,null,"LAGUAJIRA",44,null,null,"ALBANIA",35,44,"LA GUAJIRA",null,null,"PASTO",null,"BANGLADESH","BANGLADESH",null,"081",3,"081"]
[null,null,null,null,null,null,null,null,null,1950,null,"21",null,null,null,null,null,"SANANDRÉS",88,null,null,"ALBANIA",20,68,"SANTANDER",null,null,"PEREIRA",null,"BARBADOS","BARBADOS",null,"083",3,"083"]
[null,null,null,null,null,null,null,null,null,1951,null,"22",null,null,null,null,null,"VALLEDELCAUCA",76,null,null,"ALCALA",20,76,"VALLE DEL CAUCA",null,null,"PIEDECUESTA",null,"BELGICA","BELGICA",null,"087",3,"087"]
[null,null,null,null,null,null,null,null,null,1952,null,"23",null,null,null,null,null,"NORTEDESANTANDER",54,null,null,"ALDANA",22,52,"NARIÑO",null,null,"POPAYAN",null,"BELICE","BELICE",null,"088",3,"088"]
[null,null,null,null,null,null,null,null,null,1953,null,"24",null,null,null,null,null,"MAGDALENA",47,null,null,"ALEJANDRIA",21,5,"ANTIOQUIA",null,null,"RIOHACHA",null,"BELORUS","BELORUS",null,"091",3,"091"]
[null,null,null,null,null,null,null,null,null,1954,null,"25",null,null,null,null,null,"META",50,null,null,"ALGARROBO",30,47,"MAGDALENA",null,null,"SANTA MARTA",null,"BENIN","BENIN",null,229,3,229]
[null,null,null,null,null,null,null,null,null,1955,null,"26",null,null,null,null,null,"NARIÑO",52,null,null,"ALGECIRAS",20,41,"HUILA",null,null,"SINCELEJO",null,"BERMUDAS","BERMUDAS",null,"090",3,"090"]
[null,null,null,null,null,null,null,null,null,1956,null,"27",null,null,null,null,null,"PUTUMAYO",86,null,null,"ALMAGUER",22,19,"CAUCA",null,null,"SOACHA",null,"BIRMANIA (MYANMAR)","BIRMANIA (MYANMAR)",null,"093",3,"093"]
[null,null,null,null,null,null,null,null,null,1957,null,"28",null,null,null,null,null,"QUINDÍO",63,null,null,"ALMEIDA",22,15,"BOYACA",null,null,"TENJO",null,"BOLIVIA","BOLIVIA",null,"097",3,"097"]
[null,null,null,null,null,null,null,null,null,1958,null,"29",null,null,null,null,null,"RISARALDA",66,null,null,"ALPUJARRA",24,73,"TOLIMA",null,null,"TUNJA",null,"BOSNIA-HERZEGOVINA","BOSNIA-HERZEGOVINA",null,"029",3,"029"]
[null,null,null,null,null,null,null,null,null,1959,null,"30",null,null,null,null,null,"SANTANDER",68,null,null,"ALTAMIRA",26,41,"HUILA",null,null,"VILLAVICENCIO",null,"BOTSWANA","BOTSWANA",null,101,3,101]
[null,null,null,null,null,null,null,null,null,1960,null,"31",null,null,null,null,null,"SUCRE",70,null,null,"ALTO BAUDO",25,27,"CHOCO",null,null,"YOPAL",null,"BRASIL","BRASIL",null,105,3,105]
[null,null,null,null,null,null,null,null,null,1961,null,null,null,null,null,null,null,"TOLIMA",73,null,null,"ALTOS DEL ROSARIO",30,13,"BOLIVAR",null,null,"ZIPAQUIRA",null,"BRUNEI DARUSSALAM","BRUNEI DARUSSALAM",null,108,3,108]
[null,null,null,null,null,null,null,null,null,1962,null,null,null,null,null,null,null,"VAUPÉS",97,null,null,"ALVARADO",26,73,"TOLIMA",null,null,null,null,"BULGARIA","BULGARIA",null,111,3,111]
[null,null,null,null,null,null,null,null,null,1963,null,null,null,null,null,null,null,"VICHADA",99,null,null,"AMAGA",30,5,"ANTIOQUIA",null,null,null,null,"BURKINA FASSO","BURKINA FASSO",null,"031",3,"031"]
[null,null,null,null,null,null,null,null,null,1964,null,null,null,null,null,null,null,null,null,null,null,"AMALFI",31,5,"ANTIOQUIA",null,null,null,null,"BURUNDI","BURUNDI",null,115,3,115]
[null,null,null,null,null,null,null,null,null,1965,null,null,null,null,null,null,null,null,null,null,null,"AMBALEMA",30,73,"TOLIMA",null,null,null,null,"BUTAN","BUTAN",null,119,3,119]
[null,null,null,null,null,null,null,null,null,1966,null,null,null,null,null,null,null,null,null,null,null,"ANAPOIMA",35,25,"CUNDINAMARCA",null,null,null,null,"CABO VERDE","CABO VERDE",null,127,3,127]
[null,null,null,null,null,null,null,null,null,1967,null,null,null,null,null,null,null,null,null,null,null,"ANCUYA",36,52,"NARIÑO",null,null,null,null,"CAIMAN, ISLAS","CAIMAN, ISLAS",null,137,3,137]
[null,null,null,null,null,null,null,null,null,1968,null,null,null,null,null,null,null,null,null,null,null,"ANDALUCIA",36,76,"VALLE DEL CAUCA",null,null,null,null,"CAMERUN, REPUBLICA U","CAMERUN, REPUBLICA U",null,145,3,145]
[null,null,null,null,null,null,null,null,null,1969,null,null,null,null,null,null,null,null,null,null,null,"ANDES",34,5,"ANTIOQUIA",null,null,null,null,"CANADA","CANADA",null,149,3,149]
[null,null,null,null,null,null,null,null,null,1970,null,null,null,null,null,null,null,null,null,null,null,"ANGELOPOLIS",36,5,"ANTIOQUIA",null,null,null,null,"CANAL(NORMANDAS),ISL","CANAL(NORMANDAS),ISL",null,155,3,155]
[null,null,null,null,null,null,null,null,null,1971,null,null,null,null,null,null,null,null,null,null,null,"ANGOSTURA",38,5,"ANTIOQUIA",null,null,null,null,"CANTON ENDERBURY,ISL","CANTON ENDERBURY,ISL",null,157,3,157]
[null,null,null,null,null,null,null,null,null,1972,null,null,null,null,null,null,null,null,null,null,null,"ANOLAIMA",40,25,"CUNDINAMARCA",null,null,null,null,"CHAD","CHAD",null,203,3,203]
[null,null,null,null,null,null,null,null,null,1973,null,null,null,null,null,null,null,null,null,null,null,"ANORI",40,5,"ANTIOQUIA",null,null,null,null,"CHILE","CHILE",null,211,3,211]
[null,null,null,null,null,null,null,null,null,1974,null,null,null,null,null,null,null,null,null,null,null,"ANSERMA",42,17,"CALDAS",null,null,null,null,"CHINA","CHINA",null,215,3,215]
[null,null,null,null,null,null,null,null,null,1975,null,null,null,null,null,null,null,null,null,null,null,"ANSERMANUEVO",41,76,"VALLE DEL CAUCA",null,null,null,null,"CHIPRE","CHIPRE",null,221,3,221]
[null,null,null,null,null,null,null,null,null,1976,null,null,null,null,null,null,null,null,null,null,null,"ANZA",44,5,"ANTIOQUIA",null,null,null,null,"CIUDAD DEL VATICANO","CIUDAD DEL VATICANO",null,159,3,159]
[null,null,null,null,null,null,null,null,null,1977,null,null,null,null,null,null,null,null,null,null,null,"ANZOATEGUI",43,73,"TOLIMA",null,null,null,null,"COCOS (KEELING), ISL","COCOS (KEELING), ISL",null,165,3,165]
[null,null,null,null,null,null,null,null,null,1978,null,null,null,null,null,null,null,null,null,null,null,"APARTADO",45,5,"ANTIOQUIA",null,null,null,null,"COMORAS","COMORAS",null,173,3,173]
[null,null,null,null,null,null,null,null,null,1979,null,null,null,null,null,null,null,null,null,null,null,"APIA",45,66,"RISARALDA",null,null,null,null,"COMUNIDAD EUROPEA","COMUNIDAD EUROPEA",null,998,3,998]
[null,null,null,null,null,null,null,null,null,1980,null,null,null,null,null,null,null,null,null,null,null,"APULO",599,25,"CUNDINAMARCA",null,null,null,null,"CONGO","CONGO",null,177,3,177]
[null,null,null,null,null,null,null,null,null,1981,null,null,null,null,null,null,null,null,null,null,null,"AQUITANIA",47,15,"BOYACA",null,null,null,null,"COOK, ISLAS","COOK, ISLAS",null,183,3,183]
[null,null,null,null,null,null,null,null,null,1982,null,null,null,null,null,null,null,null,null,null,null,"ARACATACA",53,47,"MAGDALENA",null,null,null,null,"COREA DEL NORTE,REPU","COREA DEL NORTE,REPU",null,187,3,187]
[null,null,null,null,null,null,null,null,null,1983,null,null,null,null,null,null,null,null,null,null,null,"ARANZAZU",50,17,"CALDAS",null,null,null,null,"COREA DEL SUR, REPUB","COREA DEL SUR, REPUB",null,190,3,190]
[null,null,null,null,null,null,null,null,null,1984,null,null,null,null,null,null,null,null,null,null,null,"ARATOCA",51,68,"SANTANDER",null,null,null,null,"COSTA DE MARFIL","COSTA DE MARFIL",null,193,3,193]
[null,null,null,null,null,null,null,null,null,1985,null,null,null,null,null,null,null,null,null,null,null,"ARAUCA",1,81,"ARAUCA",null,null,null,null,"COSTA RICA","COSTA RICA",null,196,3,196]
[null,null,null,null,null,null,null,null,null,1986,null,null,null,null,null,null,null,null,null,null,null,"ARAUQUITA",65,81,"ARAUCA",null,null,null,null,"CROACIA","CROACIA",null,198,3,198]
[null,null,null,null,null,null,null,null,null,1987,null,null,null,null,null,null,null,null,null,null,null,"ARBELAEZ",53,25,"CUNDINAMARCA",null,null,null,null,"CUBA","CUBA",null,199,3,199]
[null,null,null,null,null,null,null,null,null,1988,null,null,null,null,null,null,null,null,null,null,null,"ARBOLEDA",51,52,"NARIÑO",null,null,null,null,"CURACAO","CURACAO",null,789,3,789]
[null,null,null,null,null,null,null,null,null,1989,null,null,null,null,null,null,null,null,null,null,null,"ARBOLEDAS",51,54,"NORTE DE SANTANDER",null,null,null,null,"DINAMARCA","DINAMARCA",null,232,3,232]
[null,null,null,null,null,null,null,null,null,1990,null,null,null,null,null,null,null,null,null,null,null,"ARBOLETES",51,5,"ANTIOQUIA",null,null,null,null,"DJIBOUTI","DJIBOUTI",null,783,3,783]
[null,null,null,null,null,null,null,null,null,1991,null,null,null,null,null,null,null,null,null,null,null,"ARCABUCO",51,15,"BOYACA",null,null,null,null,"DOMINICA","DOMINICA",null,235,3,235]
[null,null,null,null,null,null,null,null,null,1992,null,null,null,null,null,null,null,null,null,null,null,"ARENAL",42,13,"BOLIVAR",null,null,null,null,"ECUADOR","ECUADOR",null,239,3,239]
[null,null,null,null,null,null,null,null,null,1993,null,null,null,null,null,null,null,null,null,null,null,"ARGELIA",55,5,"ANTIOQUIA",null,null,null,null,"EGIPTO","EGIPTO",null,240,3,240]
[null,null,null,null,null,null,null,null,null,1994,null,null,null,null,null,null,null,null,null,null,null,"ARGELIA",50,19,"CAUCA",null,null,null,null,"EL SALVADOR","EL SALVADOR",null,242,3,242]
[null,null,null,null,null,null,null,null,null,1995,null,null,null,null,null,null,null,null,null,null,null,"ARGELIA",54,76,"VALLE DEL CAUCA",null,null,null,null,"EMIRATOS ARABES UNID","EMIRATOS ARABES UNID",null,244,3,244]
[null,null,null,null,null,null,null,null,null,1996,null,null,null,null,null,null,null,null,null,null,null,"ARIGUANI",58,47,"MAGDALENA",null,null,null,null,"ERITREA","ERITREA",null,243,3,243]
[null,null,null,null,null,null,null,null,null,1997,null,null,null,null,null,null,null,null,null,null,null,"ARJONA",52,13,"BOLIVAR",null,null,null,null,"ESLOVAQUIA","ESLOVAQUIA",null,246,3,246]
[null,null,null,null,null,null,null,null,null,1998,null,null,null,null,null,null,null,null,null,null,null,"ARMENIA",59,5,"ANTIOQUIA",null,null,null,null,"ESLOVENIA","ESLOVENIA",null,247,3,247]
[null,null,null,null,null,null,null,null,null,1999,null,null,null,null,null,null,null,null,null,null,null,"ARMENIA",1,63,"QUINDIO",null,null,null,null,"ESPAÑA","ESPAÑA",null,245,3,245]
[null,null,null,null,null,null,null,null,null,2000,null,null,null,null,null,null,null,null,null,null,null,"ARMERO",55,73,"TOLIMA",null,null,null,null,"ESTADOS UNIDOS","ESTADOS UNIDOS",null,249,3,249]
[null,null,null,null,null,null,null,null,null,2001,null,null,null,null,null,null,null,null,null,null,null,"ARROYOHONDO",62,13,"BOLIVAR",null,null,null,null,"ESTONIA","ESTONIA",null,251,3,251]
[null,null,null,null,null,null,null,null,null,2002,null,null,null,null,null,null,null,null,null,null,null,"ASTREA",32,20,"CESAR",null,null,null,null,"ETIOPIA","ETIOPIA",null,253,3,253]
[null,null,null,null,null,null,null,null,null,2003,null,null,null,null,null,null,null,null,null,null,null,"ATACO",67,73,"TOLIMA",null,null,null,null,"FEROE, ISLAS","FEROE, ISLAS",null,259,3,259]
[null,null,null,null,null,null,null,null,null,2004,null,null,null,null,null,null,null,null,null,null,null,"ATRATO",50,27,"CHOCO",null,null,null,null,"FIJI","FIJI",null,870,3,870]
[null,null,null,null,null,null,null,null,null,2005,null,null,null,null,null,null,null,null,null,null,null,"AYAPEL",68,23,"CORDOBA",null,null,null,null,"FILIPINAS","FILIPINAS",null,267,3,267]
[null,null,null,null,null,null,null,null,null,2006,null,null,null,null,null,null,null,null,null,null,null,"BAGADO",73,27,"CHOCO",null,null,null,null,"FINLANDIA","FINLANDIA",null,271,3,271]
[null,null,null,null,null,null,null,null,null,2007,null,null,null,null,null,null,null,null,null,null,null,"BAHIA SOLANO",75,27,"CHOCO",null,null,null,null,"FRANCIA","FRANCIA",null,275,3,275]
[null,null,null,null,null,null,null,null,null,2008,null,null,null,null,null,null,null,null,null,null,null,"BAJO BAUDO",77,27,"CHOCO",null,null,null,null,"GABON","GABON",null,281,3,281]
[null,null,null,null,null,null,null,null,null,2009,null,null,null,null,null,null,null,null,null,null,null,"BALBOA",75,19,"CAUCA",null,null,null,null,"GAMBIA","GAMBIA",null,285,3,285]
[null,null,null,null,null,null,null,null,null,2010,null,null,null,null,null,null,null,null,null,null,null,"BALBOA",75,66,"RISARALDA",null,null,null,null,"GAZA Y JERICO","GAZA Y JERICO",null,286,3,286]
[null,null,null,null,null,null,null,null,null,2011,null,null,null,null,null,null,null,null,null,null,null,"BARANOA",78,8,"ATLANTICO",null,null,null,null,"GEORGIA","GEORGIA",null,287,3,287]
[null,null,null,null,null,null,null,null,null,2012,null,null,null,null,null,null,null,null,null,null,null,"BARAYA",78,41,"HUILA",null,null,null,null,"GHANA","GHANA",null,289,3,289]
[null,null,null,null,null,null,null,null,null,2013,null,null,null,null,null,null,null,null,null,null,null,"BARBACOAS",79,52,"NARIÑO",null,null,null,null,"GIBRALTAR","GIBRALTAR",null,293,3,293]
[null,null,null,null,null,null,null,null,null,2014,null,null,null,null,null,null,null,null,null,null,null,"BARBOSA",79,5,"ANTIOQUIA",null,null,null,null,"GRANADA","GRANADA",null,297,3,297]
[null,null,null,null,null,null,null,null,null,2015,null,null,null,null,null,null,null,null,null,null,null,"BARBOSA",77,68,"SANTANDER",null,null,null,null,"GRECIA","GRECIA",null,301,3,301]
[null,null,null,null,null,null,null,null,null,2016,null,null,null,null,null,null,null,null,null,null,null,"BARICHARA",79,68,"SANTANDER",null,null,null,null,"GROENLANDIA","GROENLANDIA",null,305,3,305]
[null,null,null,null,null,null,null,null,null,2017,null,null,null,null,null,null,null,null,null,null,null,"BARRANCA DE UPIA",110,50,"META",null,null,null,null,"GUADALUPE","GUADALUPE",null,309,3,309]
[null,null,null,null,null,null,null,null,null,2018,null,null,null,null,null,null,null,null,null,null,null,"BARRANCABERMEJA",81,68,"SANTANDER",null,null,null,null,"GUAM","GUAM",null,313,3,313]
[null,null,null,null,null,null,null,null,null,2019,null,null,null,null,null,null,null,null,null,null,null,"BARRANCAS",78,44,"LA GUAJIRA",null,null,null,null,"GUATEMALA","GUATEMALA",null,317,3,317]
[null,null,null,null,null,null,null,null,null,2020,null,null,null,null,null,null,null,null,null,null,null,"BARRANCO DE LOBA",74,13,"BOLIVAR",null,null,null,null,"GUAYANA FRANCESA","GUAYANA FRANCESA",null,325,3,325]
[null,null,null,null,null,null,null,null,null,2021,null,null,null,null,null,null,null,null,null,null,null,"BARRANCO MINA",343,94,"GUAINIA",null,null,null,null,"GUINEA","GUINEA",null,329,3,329]
[null,null,null,null,null,null,null,null,null,2022,null,null,null,null,null,null,null,null,null,null,null,"BARRANQUILLA",1,8,"ATLANTICO",null,null,null,null,"GUINEA - BISSAU","GUINEA - BISSAU",null,334,3,334]
[null,null,null,null,null,null,null,null,null,2023,null,null,null,null,null,null,null,null,null,null,null,"BECERRIL",45,20,"CESAR",null,null,null,null,"GUINEA ECUATORIAL","GUINEA ECUATORIAL",null,331,3,331]
[null,null,null,null,null,null,null,null,null,2024,null,null,null,null,null,null,null,null,null,null,null,"BELALCAZAR",88,17,"CALDAS",null,null,null,null,"GUYANA","GUYANA",null,337,3,337]
[null,null,null,null,null,null,null,null,null,2025,null,null,null,null,null,null,null,null,null,null,null,"BELEN",87,15,"BOYACA",null,null,null,null,"HAITI","HAITI",null,341,3,341]
[null,null,null,null,null,null,null,null,null,2026,null,null,null,null,null,null,null,null,null,null,null,"BELEN",83,52,"NARIÑO",null,null,null,null,"HONDURAS","HONDURAS",null,345,3,345]
[null,null,null,null,null,null,null,null,null,2027,null,null,null,null,null,null,null,null,null,null,null,"BELEN DE LOS ANDAQUIES",94,18,"CAQUETA",null,null,null,null,"HONG KONG","HONG KONG",null,351,3,351]
[null,null,null,null,null,null,null,null,null,2028,null,null,null,null,null,null,null,null,null,null,null,"BELEN DE UMBRIA",88,66,"RISARALDA",null,null,null,null,"HUNGRIA","HUNGRIA",null,355,3,355]
[null,null,null,null,null,null,null,null,null,2029,null,null,null,null,null,null,null,null,null,null,null,"BELLO",88,5,"ANTIOQUIA",null,null,null,null,"INDIA","INDIA",null,361,3,361]
[null,null,null,null,null,null,null,null,null,2030,null,null,null,null,null,null,null,null,null,null,null,"BELMIRA",86,5,"ANTIOQUIA",null,null,null,null,"INDONESIA","INDONESIA",null,365,3,365]
[null,null,null,null,null,null,null,null,null,2031,null,null,null,null,null,null,null,null,null,null,null,"BELTRAN",86,25,"CUNDINAMARCA",null,null,null,null,"IRAK","IRAK",null,369,3,369]
[null,null,null,null,null,null,null,null,null,2032,null,null,null,null,null,null,null,null,null,null,null,"BERBEO",90,15,"BOYACA",null,null,null,null,"IRAN, REPUBLICA ISLA","IRAN, REPUBLICA ISLA",null,372,3,372]
[null,null,null,null,null,null,null,null,null,2033,null,null,null,null,null,null,null,null,null,null,null,"BETANIA",91,5,"ANTIOQUIA",null,null,null,null,"IRLANDA (EIRE)","IRLANDA (EIRE)",null,375,3,375]
[null,null,null,null,null,null,null,null,null,2034,null,null,null,null,null,null,null,null,null,null,null,"BETEITIVA",92,15,"BOYACA",null,null,null,null,"ISLA DE MAN","ISLA DE MAN",null,"033",3,"033"]
[null,null,null,null,null,null,null,null,null,2035,null,null,null,null,null,null,null,null,null,null,null,"BETULIA",93,5,"ANTIOQUIA",null,null,null,null,"ISLANDIA","ISLANDIA",null,379,3,379]
[null,null,null,null,null,null,null,null,null,2036,null,null,null,null,null,null,null,null,null,null,null,"BETULIA",92,68,"SANTANDER",null,null,null,null,"ISLAS MENORES ESTADOS UNIDOS","ISLAS MENORES ESTADOS UNIDOS",null,566,3,566]
[null,null,null,null,null,null,null,null,null,2037,null,null,null,null,null,null,null,null,null,null,null,"BITUIMA",95,25,"CUNDINAMARCA",null,null,null,null,"ISRAEL","ISRAEL",null,383,3,383]
[null,null,null,null,null,null,null,null,null,2038,null,null,null,null,null,null,null,null,null,null,null,"BLEN DE BAJIRA",86,27,"CHOCO",null,null,null,null,"ITALIA","ITALIA",null,386,3,386]
[null,null,null,null,null,null,null,null,null,2039,null,null,null,null,null,null,null,null,null,null,null,"BOAVITA",97,15,"BOYACA",null,null,null,null,"JAMAICA","JAMAICA",null,391,3,391]
[null,null,null,null,null,null,null,null,null,2040,null,null,null,null,null,null,null,null,null,null,null,"BOCHALEMA",99,54,"NORTE DE SANTANDER",null,null,null,null,"JAPON","JAPON",null,399,3,399]
[null,null,null,null,null,null,null,null,null,2041,null,null,null,null,null,null,null,null,null,null,null,"BOJACA",99,25,"CUNDINAMARCA",null,null,null,null,"JOHNSTON,ISLA","JOHNSTON,ISLA",null,395,3,395]
[null,null,null,null,null,null,null,null,null,null,null,null,null,null,null,null,null,null,null,null,null,"BOJAYA",99,27,"CHOCO",null,null,null,null,"JORDANIA","JORDANIA",null,403,3,403]
[null,null,null,null,null,null,null,null,null,null,null,null,null,null,null,null,null,null,null,null,null,"BOLIVAR",100,19,"CAUCA",null,null,null,null,"KAMPUCHEA (CAMBOYA)","KAMPUCHEA (CAMBOYA)",null,141,3,141]
[null,null,null,null,null,null,null,null,null,null,null,null,null,null,null,null,null,null,null,null,null,"BOLIVAR",101,68,"SANTANDER",null,null,null,null,"KAZAJSTAN","KAZAJSTAN",null,406,3,406]
[null,null,null,null,null,null,null,null,null,null,null,null,null,null,null,null,null,null,null,null,null,"BOLIVAR",100,76,"VALLE DEL CAUCA",null,null,null,null,"KENYA","KENYA",null,410,3,410]
[null,null,null,null,null,null,null,null,null,null,null,null,null,null,null,null,null,null,null,null,null,"BOSCONIA",60,20,"CESAR",null,null,null,null,"KIRGUIZISTAN","KIRGUIZISTAN",null,412,3,412]
[null,null,null,null,null,null,null,null,null,null,null,null,null,null,null,null,null,null,null,null,null,"BOYACA",104,15,"BOYACA",null,null,null,null,"KIRIBATI","KIRIBATI",null,411,3,411]
[null,null,null,null,null,null,null,null,null,null,null,null,null,null,null,null,null,null,null,null,null,"BRICEÑO",107,5,"ANTIOQUIA",null,null,null,null,"KUWAIT","KUWAIT",null,413,3,413]
[null,null,null,null,null,null,null,null,null,null,null,null,null,null,null,null,null,null,null,null,null,"BRICEÑO",106,15,"BOYACA",null,null,null,null,"LAOS,REPUBLICA POPUL","LAOS,REPUBLICA POPUL",null,420,3,420]
[null,null,null,null,null,null,null,null,null,null,null,null,null,null,null,null,null,null,null,null,null,"BUCARAMANGA",1,68,"SANTANDER",null,null,null,null,"LESOTHO","LESOTHO",null,426,3,426]
[null,null,null,null,null,null,null,null,null,null,null,null,null,null,null,null,null,null,null,null,null,"BUCARASICA",109,54,"NORTE DE SANTANDER",null,null,null,null,"LETONIA","LETONIA",null,429,3,429]
[null,null,null,null,null,null,null,null,null,null,null,null,null,null,null,null,null,null,null,null,null,"BUENAVENTURA",109,76,"VALLE DEL CAUCA",null,null,null,null,"LIBANO","LIBANO",null,431,3,431]
[null,null,null,null,null,null,null,null,null,null,null,null,null,null,null,null,null,null,null,null,null,"BUENAVISTA",109,15,"BOYACA",null,null,null,null,"LIBERIA","LIBERIA",null,434,3,434]
[null,null,null,null,null,null,null,null,null,null,null,null,null,null,null,null,null,null,null,null,null,"BUENAVISTA",79,23,"CORDOBA",null,null,null,null,"LIBIA(INCLUYE FEZZAN","LIBIA(INCLUYE FEZZAN",null,438,3,438]
[null,null,null,null,null,null,null,null,null,null,null,null,null,null,null,null,null,null,null,null,null,"BUENAVISTA",111,63,"QUINDIO",null,null,null,null,"LIECHTENSTEIN","LIECHTENSTEIN",null,440,3,440]
[null,null,null,null,null,null,null,null,null,null,null,null,null,null,null,null,null,null,null,null,null,"BUENAVISTA",110,70,"SUCRE",null,null,null,null,"LITUANIA","LITUANIA",null,443,3,443]
[null,null,null,null,null,null,null,null,null,null,null,null,null,null,null,null,null,null,null,null,null,"BUENOS AIRES",110,19,"CAUCA",null,null,null,null,"LUXEMBURGO","LUXEMBURGO",null,445,3,445]
[null,null,null,null,null,null,null,null,null,null,null,null,null,null,null,null,null,null,null,null,null,"BUESACO",110,52,"NARIÑO",null,null,null,null,"MACAO","MACAO",null,447,3,447]
[null,null,null,null,null,null,null,null,null,null,null,null,null,null,null,null,null,null,null,null,null,"BUGALAGRANDE",113,76,"VALLE DEL CAUCA",null,null,null,null,"MACEDONIA","MACEDONIA",null,448,3,448]
[null,null,null,null,null,null,null,null,null,null,null,null,null,null,null,null,null,null,null,null,null,"BURITICA",113,5,"ANTIOQUIA",null,null,null,null,"MADAGASCAR","MADAGASCAR",null,450,3,450]
[null,null,null,null,null,null,null,null,null,null,null,null,null,null,null,null,null,null,null,null,null,"BUSBANZA",114,15,"BOYACA",null,null,null,null,"MALASIA","MALASIA",null,455,3,455]
[null,null,null,null,null,null,null,null,null,null,null,null,null,null,null,null,null,null,null,null,null,"CABRERA",120,25,"CUNDINAMARCA",null,null,null,null,"MALAWI","MALAWI",null,458,3,458]
[null,null,null,null,null,null,null,null,null,null,null,null,null,null,null,null,null,null,null,null,null,"CABRERA",121,68,"SANTANDER",null,null,null,null,"MALDIVAS","MALDIVAS",null,461,3,461]
[null,null,null,null,null,null,null,null,null,null,null,null,null,null,null,null,null,null,null,null,null,"CABUYARO",124,50,"META",null,null,null,null,"MALI","MALI",null,464,3,464]
[null,null,null,null,null,null,null,null,null,null,null,null,null,null,null,null,null,null,null,null,null,"CACAHUAL",886,94,"GUAINIA",null,null,null,null,"MALTA","MALTA",null,467,3,467]
[null,null,null,null,null,null,null,null,null,null,null,null,null,null,null,null,null,null,null,null,null,"CACERES",120,5,"ANTIOQUIA",null,null,null,null,"MARIANAS DEL NORTE,I","MARIANAS DEL NORTE,I",null,469,3,469]
[null,null,null,null,null,null,null,null,null,null,null,null,null,null,null,null,null,null,null,null,null,"CACHIPAY",123,25,"CUNDINAMARCA",null,null,null,null,"MARRUECOS","MARRUECOS",null,474,3,474]
[null,null,null,null,null,null,null,null,null,null,null,null,null,null,null,null,null,null,null,null,null,"CACHIRA",128,54,"NORTE DE SANTANDER",null,null,null,null,"MARSHALL, ISLAS","MARSHALL, ISLAS",null,472,3,472]
[null,null,null,null,null,null,null,null,null,null,null,null,null,null,null,null,null,null,null,null,null,"CACOTA",125,54,"NORTE DE SANTANDER",null,null,null,null,"MARTINICA","MARTINICA",null,477,3,477]
[null,null,null,null,null,null,null,null,null,null,null,null,null,null,null,null,null,null,null,null,null,"CAICEDO",125,5,"ANTIOQUIA",null,null,null,null,"MAURICIO","MAURICIO",null,485,3,485]
[null,null,null,null,null,null,null,null,null,null,null,null,null,null,null,null,null,null,null,null,null,"CAICEDONIA",122,76,"VALLE DEL CAUCA",null,null,null,null,"MAURITANIA","MAURITANIA",null,488,3,488]
[null,null,null,null,null,null,null,null,null,null,null,null,null,null,null,null,null,null,null,null,null,"CAIMITO",124,70,"SUCRE",null,null,null,null,"MEXICO","MEXICO",null,493,3,493]
[null,null,null,null,null,null,null,null,null,null,null,null,null,null,null,null,null,null,null,null,null,"CAJAMARCA",124,73,"TOLIMA",null,null,null,null,"MICRONESIA,ESTADOS F","MICRONESIA,ESTADOS F",null,494,3,494]
[null,null,null,null,null,null,null,null,null,null,null,null,null,null,null,null,null,null,null,null,null,"CAJIBIO",130,19,"CAUCA",null,null,null,null,"MIDWAY, ISLAS","MIDWAY, ISLAS",null,495,3,495]
[null,null,null,null,null,null,null,null,null,null,null,null,null,null,null,null,null,null,null,null,null,"CAJICA",126,25,"CUNDINAMARCA",null,null,null,null,"MOLDAVIA","MOLDAVIA",null,496,3,496]
[null,null,null,null,null,null,null,null,null,null,null,null,null,null,null,null,null,null,null,null,null,"CALAMAR",140,13,"BOLIVAR",null,null,null,null,"MONACO","MONACO",null,498,3,498]
[null,null,null,null,null,null,null,null,null,null,null,null,null,null,null,null,null,null,null,null,null,"CALAMAR",15,95,"GUAVIARE",null,null,null,null,"MONGOLIA","MONGOLIA",null,497,3,497]
[null,null,null,null,null,null,null,null,null,null,null,null,null,null,null,null,null,null,null,null,null,"CALARCA",130,63,"QUINDIO",null,null,null,null,"MONSERRAT, ISLA","MONSERRAT, ISLA",null,501,3,501]
[null,null,null,null,null,null,null,null,null,null,null,null,null,null,null,null,null,null,null,null,null,"CALDAS",129,5,"ANTIOQUIA",null,null,null,null,"MONTENEGRO","MONTENEGRO",null,502,3,502]
[null,null,null,null,null,null,null,null,null,null,null,null,null,null,null,null,null,null,null,null,null,"CALDAS",131,15,"BOYACA",null,null,null,null,"MOZAMBIQUE","MOZAMBIQUE",null,505,3,505]
[null,null,null,null,null,null,null,null,null,null,null,null,null,null,null,null,null,null,null,null,null,"CALDONO",137,19,"CAUCA",null,null,null,null,"NAMIBIA","NAMIBIA",null,507,3,507]
[null,null,null,null,null,null,null,null,null,null,null,null,null,null,null,null,null,null,null,null,null,"CALI",1,76,"VALLE DEL CAUCA",null,null,null,null,"NAURU","NAURU",null,508,3,508]
[null,null,null,null,null,null,null,null,null,null,null,null,null,null,null,null,null,null,null,null,null,"CALIFORNIA",132,68,"SANTANDER",null,null,null,null,"NAVIDAD (CHRISTMAS)","NAVIDAD (CHRISTMAS)",null,511,3,511]
[null,null,null,null,null,null,null,null,null,null,null,null,null,null,null,null,null,null,null,null,null,"CALIMA",126,76,"VALLE DEL CAUCA",null,null,null,null,"NEPAL","NEPAL",null,517,3,517]
[null,null,null,null,null,null,null,null,null,null,null,null,null,null,null,null,null,null,null,null,null,"CALOTO",142,19,"CAUCA",null,null,null,null,"NICARAGUA","NICARAGUA",null,521,3,521]
[null,null,null,null,null,null,null,null,null,null,null,null,null,null,null,null,null,null,null,null,null,"CAMPAMENTO",134,5,"ANTIOQUIA",null,null,null,null,"NIGER","NIGER",null,525,3,525]
[null,null,null,null,null,null,null,null,null,null,null,null,null,null,null,null,null,null,null,null,null,"CAMPO DE LA CRUZ",137,8,"ATLANTICO",null,null,null,null,"NIGERIA","NIGERIA",null,528,3,528]
[null,null,null,null,null,null,null,null,null,null,null,null,null,null,null,null,null,null,null,null,null,"CAMPOALEGRE",132,41,"HUILA",null,null,null,null,"NIUE, ISLA","NIUE, ISLA",null,531,3,531]
[null,null,null,null,null,null,null,null,null,null,null,null,null,null,null,null,null,null,null,null,null,"CAMPOHERMOSO",135,15,"BOYACA",null,null,null,null,"NIVE ISLA","NIVE ISLA",null,1,1,1]
[null,null,null,null,null,null,null,null,null,null,null,null,null,null,null,null,null,null,null,null,null,"CANALETE",90,23,"CORDOBA",null,null,null,null,"NO DECLARADOS","NO DECLARADOS",null,999,3,999]
[null,null,null,null,null,null,null,null,null,null,null,null,null,null,null,null,null,null,null,null,null,"CANDELARIA",141,8,"ATLANTICO",null,null,null,null,"NORFOLK, ISLA","NORFOLK, ISLA",null,535,3,535]
[null,null,null,null,null,null,null,null,null,null,null,null,null,null,null,null,null,null,null,null,null,"CANDELARIA",130,76,"VALLE DEL CAUCA",null,null,null,null,"NORUEGA","NORUEGA",null,538,3,538]
[null,null,null,null,null,null,null,null,null,null,null,null,null,null,null,null,null,null,null,null,null,"CANTAGALLO",160,13,"BOLIVAR",null,null,null,null,"NUEVA CALEDONIA","NUEVA CALEDONIA",null,542,3,542]
[null,null,null,null,null,null,null,null,null,null,null,null,null,null,null,null,null,null,null,null,null,"CANTON DE SAN PABLO",135,27,"CHOCO",null,null,null,null,"NUEVA ZELANDIA","NUEVA ZELANDIA",null,548,3,548]
[null,null,null,null,null,null,null,null,null,null,null,null,null,null,null,null,null,null,null,null,null,"CAÑASGORDAS",138,5,"ANTIOQUIA",null,null,null,null,"OMAN","OMAN",null,556,3,556]
[null,null,null,null,null,null,null,null,null,null,null,null,null,null,null,null,null,null,null,null,null,"CAPARRAPI",148,25,"CUNDINAMARCA",null,null,null,null,"PAISES BAJOS(HOLANDA","PAISES BAJOS(HOLANDA",null,573,3,573]
[null,null,null,null,null,null,null,null,null,null,null,null,null,null,null,null,null,null,null,null,null,"CAPITANEJO",147,68,"SANTANDER",null,null,null,null,"PAKISTAN","PAKISTAN",null,576,3,576]
[null,null,null,null,null,null,null,null,null,null,null,null,null,null,null,null,null,null,null,null,null,"CAQUEZA",151,25,"CUNDINAMARCA",null,null,null,null,"PALAU, ISLAS","PALAU, ISLAS",null,578,3,578]
[null,null,null,null,null,null,null,null,null,null,null,null,null,null,null,null,null,null,null,null,null,"CARACOLI",142,5,"ANTIOQUIA",null,null,null,null,"PANAMA","PANAMA",null,580,3,580]
[null,null,null,null,null,null,null,null,null,null,null,null,null,null,null,null,null,null,null,null,null,"CARAMANTA",145,5,"ANTIOQUIA",null,null,null,null,"PAPUASIA NUEV GUINEA","PAPUASIA NUEV GUINEA",null,545,3,545]
[null,null,null,null,null,null,null,null,null,null,null,null,null,null,null,null,null,null,null,null,null,"CARCASI",152,68,"SANTANDER",null,null,null,null,"PARAGUAY","PARAGUAY",null,586,3,586]
[null,null,null,null,null,null,null,null,null,null,null,null,null,null,null,null,null,null,null,null,null,"CAREPA",147,5,"ANTIOQUIA",null,null,null,null,"PERU","PERU",null,589,3,589]
[null,null,null,null,null,null,null,null,null,null,null,null,null,null,null,null,null,null,null,null,null,"CARMEN APICALA",148,73,"TOLIMA",null,null,null,null,"PITCAIRN, ISLA","PITCAIRN, ISLA",null,593,3,593]
[null,null,null,null,null,null,null,null,null,null,null,null,null,null,null,null,null,null,null,null,null,"CARMEN DE CARUPA",154,25,"CUNDINAMARCA",null,null,null,null,"POLINESIA FRANCESA","POLINESIA FRANCESA",null,599,3,599]
[null,null,null,null,null,null,null,null,null,null,null,null,null,null,null,null,null,null,null,null,null,"CARMEN DE VIBORAL",148,5,"ANTIOQUIA",null,null,null,null,"POLONIA","POLONIA",null,603,3,603]
[null,null,null,null,null,null,null,null,null,null,null,null,null,null,null,null,null,null,null,null,null,"CARMEN DEL DARIEN",150,27,"CHOCO",null,null,null,null,"PORTUGAL","PORTUGAL",null,607,3,607]
[null,null,null,null,null,null,null,null,null,null,null,null,null,null,null,null,null,null,null,null,null,"CAROLINA",150,5,"ANTIOQUIA",null,null,null,null,"PUERTO RICO","PUERTO RICO",null,611,3,611]
[null,null,null,null,null,null,null,null,null,null,null,null,null,null,null,null,null,null,null,null,null,"CARTAGENA",1,13,"BOLIVAR",null,null,null,null,"QATAR","QATAR",null,618,3,618]
[null,null,null,null,null,null,null,null,null,null,null,null,null,null,null,null,null,null,null,null,null,"CARTAGENA DEL CHAIRA",150,18,"CAQUETA",null,null,null,null,"REINO UNIDO","REINO UNIDO",null,628,3,628]
[null,null,null,null,null,null,null,null,null,null,null,null,null,null,null,null,null,null,null,null,null,"CARTAGO",147,76,"VALLE DEL CAUCA",null,null,null,null,"REP. DEMOCRÁTICA DEL CONGO","REP. DEMOCRÁTICA DEL CONGO",null,888,3,888]
[null,null,null,null,null,null,null,null,null,null,null,null,null,null,null,null,null,null,null,null,null,"CARURU",161,97,"VAUPES",null,null,null,null,"REPUBLICA CENTROAFRI","REPUBLICA CENTROAFRI",null,640,3,640]
[null,null,null,null,null,null,null,null,null,null,null,null,null,null,null,null,null,null,null,null,null,"CASABIANCA",152,73,"TOLIMA",null,null,null,null,"REPUBLICA CHECA","REPUBLICA CHECA",null,644,3,644]
[null,null,null,null,null,null,null,null,null,null,null,null,null,null,null,null,null,null,null,null,null,"CASTILLA LA NUEVA",150,50,"META",null,null,null,null,"REPUBLICA DOMINICANA","REPUBLICA DOMINICANA",null,647,3,647]
[null,null,null,null,null,null,null,null,null,null,null,null,null,null,null,null,null,null,null,null,null,"CAUCASIA",154,5,"ANTIOQUIA",null,null,null,null,"REUNION","REUNION",null,660,3,660]
[null,null,null,null,null,null,null,null,null,null,null,null,null,null,null,null,null,null,null,null,null,"CEPITA",160,68,"SANTANDER",null,null,null,null,"RUMANIA","RUMANIA",null,670,3,670]
[null,null,null,null,null,null,null,null,null,null,null,null,null,null,null,null,null,null,null,null,null,"CERETE",162,23,"CORDOBA",null,null,null,null,"RUSIA","RUSIA",null,676,3,676]
[null,null,null,null,null,null,null,null,null,null,null,null,null,null,null,null,null,null,null,null,null,"CERINZA",162,15,"BOYACA",null,null,null,null,"RWANDA","RWANDA",null,675,3,675]
[null,null,null,null,null,null,null,null,null,null,null,null,null,null,null,null,null,null,null,null,null,"CERRITO",162,68,"SANTANDER",null,null,null,null,"SAHARA OCCIDENTAL","SAHARA OCCIDENTAL",null,685,3,685]
[null,null,null,null,null,null,null,null,null,null,null,null,null,null,null,null,null,null,null,null,null,"CERRO SAN ANTONIO",161,47,"MAGDALENA",null,null,null,null,"SALOMSN, ISLAS","SALOMSN, ISLAS",null,677,3,677]
[null,null,null,null,null,null,null,null,null,null,null,null,null,null,null,null,null,null,null,null,null,"CERTEGUI",160,27,"CHOCO",null,null,null,null,"SAMOA","SAMOA",null,687,3,687]
[null,null,null,null,null,null,null,null,null,null,null,null,null,null,null,null,null,null,null,null,null,"CHACHAGÜI",240,52,"NARIÑO",null,null,null,null,"SAMOA NORTEAMERICANA","SAMOA NORTEAMERICANA",null,690,3,690]
[null,null,null,null,null,null,null,null,null,null,null,null,null,null,null,null,null,null,null,null,null,"CHAGUANI",168,25,"CUNDINAMARCA",null,null,null,null,"SAN CRISTOBAL Y NIEVES","SAN CRISTOBAL Y NIEVES",null,695,3,695]
[null,null,null,null,null,null,null,null,null,null,null,null,null,null,null,null,null,null,null,null,null,"CHALAN",230,70,"SUCRE",null,null,null,null,"SAN MARINO","SAN MARINO",null,697,3,697]
[null,null,null,null,null,null,null,null,null,null,null,null,null,null,null,null,null,null,null,null,null,"CHAMEZA",15,85,"CASANARE",null,null,null,null,"SAN PEDRO Y MIGUELON","SAN PEDRO Y MIGUELON",null,700,3,700]
[null,null,null,null,null,null,null,null,null,null,null,null,null,null,null,null,null,null,null,null,null,"CHAPARRAL",168,73,"TOLIMA",null,null,null,null,"SAN VICENTE Y LAS GR","SAN VICENTE Y LAS GR",null,705,3,705]
[null,null,null,null,null,null,null,null,null,null,null,null,null,null,null,null,null,null,null,null,null,"CHARALA",167,68,"SANTANDER",null,null,null,null,"SANTA ELENA","SANTA ELENA",null,710,3,710]
[null,null,null,null,null,null,null,null,null,null,null,null,null,null,null,null,null,null,null,null,null,"CHARTA",169,68,"SANTANDER",null,null,null,null,"SANTA LUCIA","SANTA LUCIA",null,715,3,715]
[null,null,null,null,null,null,null,null,null,null,null,null,null,null,null,null,null,null,null,null,null,"CHIA",175,25,"CUNDINAMARCA",null,null,null,null,"SANTO TOME Y PRINCIP","SANTO TOME Y PRINCIP",null,720,3,720]
[null,null,null,null,null,null,null,null,null,null,null,null,null,null,null,null,null,null,null,null,null,"CHIGORODO",172,5,"ANTIOQUIA",null,null,null,null,"SENEGAL","SENEGAL",null,728,3,728]
[null,null,null,null,null,null,null,null,null,null,null,null,null,null,null,null,null,null,null,null,null,"CHIMA",168,23,"CORDOBA",null,null,null,null,"SERBIA","SERBIA",null,"032",3,"032"]
[null,null,null,null,null,null,null,null,null,null,null,null,null,null,null,null,null,null,null,null,null,"CHIMA",176,68,"SANTANDER",null,null,null,null,"SEYCHELLES","SEYCHELLES",null,731,3,731]
[null,null,null,null,null,null,null,null,null,null,null,null,null,null,null,null,null,null,null,null,null,"CHIMICHAGUA",175,20,"CESAR",null,null,null,null,"SIERRA LEONA","SIERRA LEONA",null,735,3,735]
[null,null,null,null,null,null,null,null,null,null,null,null,null,null,null,null,null,null,null,null,null,"CHINACOTA",172,54,"NORTE DE SANTANDER",null,null,null,null,"SINGAPUR","SINGAPUR",null,741,3,741]
[null,null,null,null,null,null,null,null,null,null,null,null,null,null,null,null,null,null,null,null,null,"CHINAVITA",172,15,"BOYACA",null,null,null,null,"SIRIA,REPUBLICA ARAB","SIRIA,REPUBLICA ARAB",null,744,3,744]
[null,null,null,null,null,null,null,null,null,null,null,null,null,null,null,null,null,null,null,null,null,"CHINCHINA",174,17,"CALDAS",null,null,null,null,"SOMALIA","SOMALIA",null,748,3,748]
[null,null,null,null,null,null,null,null,null,null,null,null,null,null,null,null,null,null,null,null,null,"CHINU",182,23,"CORDOBA",null,null,null,null,"SRI LANKA","SRI LANKA",null,750,3,750]
[null,null,null,null,null,null,null,null,null,null,null,null,null,null,null,null,null,null,null,null,null,"CHIPAQUE",178,25,"CUNDINAMARCA",null,null,null,null,"SUDAFRICA,REPUBLICA","SUDAFRICA,REPUBLICA",null,756,3,756]
[null,null,null,null,null,null,null,null,null,null,null,null,null,null,null,null,null,null,null,null,null,"CHIPATA",179,68,"SANTANDER",null,null,null,null,"SUDAN","SUDAN",null,759,3,759]
[null,null,null,null,null,null,null,null,null,null,null,null,null,null,null,null,null,null,null,null,null,"CHIQUINQUIRA",176,15,"BOYACA",null,null,null,null,"SUECIA","SUECIA",null,764,3,764]
[null,null,null,null,null,null,null,null,null,null,null,null,null,null,null,null,null,null,null,null,null,"CHIQUIZA",232,15,"BOYACA",null,null,null,null,"SUIZA","SUIZA",null,767,3,767]
[null,null,null,null,null,null,null,null,null,null,null,null,null,null,null,null,null,null,null,null,null,"CHIRIGUANA",178,20,"CESAR",null,null,null,null,"SURINAM","SURINAM",null,770,3,770]
[null,null,null,null,null,null,null,null,null,null,null,null,null,null,null,null,null,null,null,null,null,"CHISCAS",180,15,"BOYACA",null,null,null,null,"SWAZILANDIA","SWAZILANDIA",null,773,3,773]
[null,null,null,null,null,null,null,null,null,null,null,null,null,null,null,null,null,null,null,null,null,"CHITA",183,15,"BOYACA",null,null,null,null,"TADJIKISTAN","TADJIKISTAN",null,774,3,774]
[null,null,null,null,null,null,null,null,null,null,null,null,null,null,null,null,null,null,null,null,null,"CHITAGA",174,54,"NORTE DE SANTANDER",null,null,null,null,"TAILANDIA","TAILANDIA",null,776,3,776]
[null,null,null,null,null,null,null,null,null,null,null,null,null,null,null,null,null,null,null,null,null,"CHITARAQUE",185,15,"BOYACA",null,null,null,null,"TAIWAN (FORMOSA)","TAIWAN (FORMOSA)",null,218,3,218]
[null,null,null,null,null,null,null,null,null,null,null,null,null,null,null,null,null,null,null,null,null,"CHIVATA",187,15,"BOYACA",null,null,null,null,"TANZANIA,REPUBLICA U","TANZANIA,REPUBLICA U",null,780,3,780]
[null,null,null,null,null,null,null,null,null,null,null,null,null,null,null,null,null,null,null,null,null,"CHIVOLO",170,47,"MAGDALENA",null,null,null,null,"TERR. AUTÓNOMOS DE PALESTINA","TERR. AUTÓNOMOS DE PALESTINA",null,579,3,579]
[null,null,null,null,null,null,null,null,null,null,null,null,null,null,null,null,null,null,null,null,null,"CHIVOR",236,15,"BOYACA",null,null,null,null,"TERRI ANTARTICO BRIT","TERRI ANTARTICO BRIT",null,786,3,786]
[null,null,null,null,null,null,null,null,null,null,null,null,null,null,null,null,null,null,null,null,null,"CHOACHI",181,25,"CUNDINAMARCA",null,null,null,null,"TERRITORI BRITANICO","TERRITORI BRITANICO",null,787,3,787]
[null,null,null,null,null,null,null,null,null,null,null,null,null,null,null,null,null,null,null,null,null,"CHOCONTA",183,25,"CUNDINAMARCA",null,null,null,null,"TIMOR DEL ESTE","TIMOR DEL ESTE",null,788,3,788]
[null,null,null,null,null,null,null,null,null,null,null,null,null,null,null,null,null,null,null,null,null,"CICUCO",188,13,"BOLIVAR",null,null,null,null,"TOGO","TOGO",null,800,3,800]
[null,null,null,null,null,null,null,null,null,null,null,null,null,null,null,null,null,null,null,null,null,"CIENAGA",189,47,"MAGDALENA",null,null,null,null,"TOKELAU","TOKELAU",null,805,3,805]
[null,null,null,null,null,null,null,null,null,null,null,null,null,null,null,null,null,null,null,null,null,"CIENAGA DE ORO",189,23,"CORDOBA",null,null,null,null,"TONGA","TONGA",null,810,3,810]
[null,null,null,null,null,null,null,null,null,null,null,null,null,null,null,null,null,null,null,null,null,"CIENEGA",189,15,"BOYACA",null,null,null,null,"TRINIDAD Y TOBAGO","TRINIDAD Y TOBAGO",null,815,3,815]
[null,null,null,null,null,null,null,null,null,null,null,null,null,null,null,null,null,null,null,null,null,"CIMITARRA",190,68,"SANTANDER",null,null,null,null,"TUNICIA","TUNICIA",null,820,3,820]
[null,null,null,null,null,null,null,null,null,null,null,null,null,null,null,null,null,null,null,null,null,"CIRCASIA",190,63,"QUINDIO",null,null,null,null,"TURCAS Y CAICOS,ISLA","TURCAS Y CAICOS,ISLA",null,823,3,823]
[null,null,null,null,null,null,null,null,null,null,null,null,null,null,null,null,null,null,null,null,null,"CISNEROS",190,5,"ANTIOQUIA",null,null,null,null,"TURKMENISTAN","TURKMENISTAN",null,825,3,825]
[null,null,null,null,null,null,null,null,null,null,null,null,null,null,null,null,null,null,null,null,null,"CIUDAD BOLIVAR",101,5,"ANTIOQUIA",null,null,null,null,"TURQUIA","TURQUIA",null,827,3,827]
[null,null,null,null,null,null,null,null,null,null,null,null,null,null,null,null,null,null,null,null,null,"CLEMENCIA",222,13,"BOLIVAR",null,null,null,null,"TUVALU","TUVALU",null,828,3,828]
[null,null,null,null,null,null,null,null,null,null,null,null,null,null,null,null,null,null,null,null,null,"COCORNA",197,5,"ANTIOQUIA",null,null,null,null,"UCRANIA","UCRANIA",null,830,3,830]
[null,null,null,null,null,null,null,null,null,null,null,null,null,null,null,null,null,null,null,null,null,"COELLO",200,73,"TOLIMA",null,null,null,null,"UGANDA","UGANDA",null,833,3,833]
[null,null,null,null,null,null,null,null,null,null,null,null,null,null,null,null,null,null,null,null,null,"COGUA",200,25,"CUNDINAMARCA",null,null,null,null,"URUGUAY","URUGUAY",null,845,3,845]
[null,null,null,null,null,null,null,null,null,null,null,null,null,null,null,null,null,null,null,null,null,"COLOMBIA",206,41,"HUILA",null,null,null,null,"UZBEKISTAN","UZBEKISTAN",null,847,3,847]
[null,null,null,null,null,null,null,null,null,null,null,null,null,null,null,null,null,null,null,null,null,"COLON",203,52,"NARIÑO",null,null,null,null,"VANUATU","VANUATU",null,551,3,551]
[null,null,null,null,null,null,null,null,null,null,null,null,null,null,null,null,null,null,null,null,null,"COLON",219,86,"PUTUMAYO",null,null,null,null,"VENEZUELA","VENEZUELA",null,850,3,850]
[null,null,null,null,null,null,null,null,null,null,null,null,null,null,null,null,null,null,null,null,null,"COLOSO",204,70,"SUCRE",null,null,null,null,"VIETNAM","VIETNAM",null,855,3,855]
[null,null,null,null,null,null,null,null,null,null,null,null,null,null,null,null,null,null,null,null,null,"COMBITA",204,15,"BOYACA",null,null,null,null,"VIRGENES,ISLAS(BRITA","VIRGENES,ISLAS(BRITA",null,863,3,863]
[null,null,null,null,null,null,null,null,null,null,null,null,null,null,null,null,null,null,null,null,null,"CONCEPCION",206,5,"ANTIOQUIA",null,null,null,null,"VIRGENES,ISLAS(NORTE","VIRGENES,ISLAS(NORTE",null,866,3,866]
[null,null,null,null,null,null,null,null,null,null,null,null,null,null,null,null,null,null,null,null,null,"CONCEPCION",207,68,"SANTANDER",null,null,null,null,"WALLIS Y FORTUNA,ISL","WALLIS Y FORTUNA,ISL",null,875,3,875]
[null,null,null,null,null,null,null,null,null,null,null,null,null,null,null,null,null,null,null,null,null,"CONCORDIA",209,5,"ANTIOQUIA",null,null,null,null,"YEMEN","YEMEN",null,880,3,880]
[null,null,null,null,null,null,null,null,null,null,null,null,null,null,null,null,null,null,null,null,null,"CONCORDIA",205,47,"MAGDALENA",null,null,null,null,"YUGOSLAVIA","YUGOSLAVIA",null,885,3,885]
[null,null,null,null,null,null,null,null,null,null,null,null,null,null,null,null,null,null,null,null,null,"CONDOTO",205,27,"CHOCO",null,null,null,null,"ZAMBIA","ZAMBIA",null,890,3,890]
[null,null,null,null,null,null,null,null,null,null,null,null,null,null,null,null,null,null,null,null,null,"CONFINES",209,68,"SANTANDER",null,null,null,null,"ZIMBABWE","ZIMBABWE",null,665,3,665]
[null,null,null,null,null,null,null,null,null,null,null,null,null,null,null,null,null,null,null,null,null,"CONSACA",207,52,"NARIÑO",null,null,null,null,"ZONA CANAL DE PANAMA","ZONA CANAL DE PANAMA",null,895,3,895]
[null,null,null,null,null,null,null,null,null,null,null,null,null,null,null,null,null,null,null,null,null,"CONTADERO",210,52,"NARIÑO",null,null,null,null,"ZONA NEUTRAL(PALESTA","ZONA NEUTRAL(PALESTA",null,897,3,897]
[null,null,null,null,null,null,null,null,null,null,null,null,null,null,null,null,null,null,null,null,null,"CONTRATACION",211,68,"SANTANDER"]
[null,null,null,null,null,null,null,null,null,null,null,null,null,null,null,null,null,null,null,null,null,"CONVENCION",206,54,"NORTE DE SANTANDER"]
[null,null,null,null,null,null,null,null,null,null,null,null,null,null,null,null,null,null,null,null,null,"COPACABANA",212,5,"ANTIOQUIA"]
[null,null,null,null,null,null,null,null,null,null,null,null,null,null,null,null,null,null,null,null,null,"COPER",212,15,"BOYACA"]
[null,null,null,null,null,null,null,null,null,null,null,null,null,null,null,null,null,null,null,null,null,"CORDOBA",212,13,"BOLIVAR"]
[null,null,null,null,null,null,null,null,null,null,null,null,null,null,null,null,null,null,null,null,null,"CORDOBA",215,52,"NARIÑO"]
[null,null,null,null,null,null,null,null,null,null,null,null,null,null,null,null,null,null,null,null,null,"CORDOBA",212,63,"QUINDIO"]
[null,null,null,null,null,null,null,null,null,null,null,null,null,null,null,null,null,null,null,null,null,"CORINTO",212,19,"CAUCA"]
[null,null,null,null,null,null,null,null,null,null,null,null,null,null,null,null,null,null,null,null,null,"COROMORO",217,68,"SANTANDER"]
[null,null,null,null,null,null,null,null,null,null,null,null,null,null,null,null,null,null,null,null,null,"COROZAL",215,70,"SUCRE"]
[null,null,null,null,null,null,null,null,null,null,null,null,null,null,null,null,null,null,null,null,null,"CORRALES",215,15,"BOYACA"]
[null,null,null,null,null,null,null,null,null,null,null,null,null,null,null,null,null,null,null,null,null,"COTA",214,25,"CUNDINAMARCA"]
[null,null,null,null,null,null,null,null,null,null,null,null,null,null,null,null,null,null,null,null,null,"COTORRA",300,23,"CORDOBA"]
[null,null,null,null,null,null,null,null,null,null,null,null,null,null,null,null,null,null,null,null,null,"COVARACHIA",218,15,"BOYACA"]
[null,null,null,null,null,null,null,null,null,null,null,null,null,null,null,null,null,null,null,null,null,"COVEÑAS",221,70,"SUCRE"]
[null,null,null,null,null,null,null,null,null,null,null,null,null,null,null,null,null,null,null,null,null,"COYAIMA",217,73,"TOLIMA"]
[null,null,null,null,null,null,null,null,null,null,null,null,null,null,null,null,null,null,null,null,null,"CRAVO NORTE",220,81,"ARAUCA"]
[null,null,null,null,null,null,null,null,null,null,null,null,null,null,null,null,null,null,null,null,null,"CUASPUD",224,52,"NARIÑO"]
[null,null,null,null,null,null,null,null,null,null,null,null,null,null,null,null,null,null,null,null,null,"CUBARA",223,15,"BOYACA"]
[null,null,null,null,null,null,null,null,null,null,null,null,null,null,null,null,null,null,null,null,null,"CUCAITA",224,15,"BOYACA"]
[null,null,null,null,null,null,null,null,null,null,null,null,null,null,null,null,null,null,null,null,null,"CUCUNUBA",224,25,"CUNDINAMARCA"]
[null,null,null,null,null,null,null,null,null,null,null,null,null,null,null,null,null,null,null,null,null,"CUCUTA",1,54,"NORTE DE SANTANDER"]
[null,null,null,null,null,null,null,null,null,null,null,null,null,null,null,null,null,null,null,null,null,"CUCUTILLA",223,54,"NORTE DE SANTANDER"]
[null,null,null,null,null,null,null,null,null,null,null,null,null,null,null,null,null,null,null,null,null,"CUITIVA",226,15,"BOYACA"]
[null,null,null,null,null,null,null,null,null,null,null,null,null,null,null,null,null,null,null,null,null,"CUMARAL",226,50,"META"]
[null,null,null,null,null,null,null,null,null,null,null,null,null,null,null,null,null,null,null,null,null,"CUMARIBO",773,99,"VICHADA"]
[null,null,null,null,null,null,null,null,null,null,null,null,null,null,null,null,null,null,null,null,null,"CUMBAL",227,52,"NARIÑO"]
[null,null,null,null,null,null,null,null,null,null,null,null,null,null,null,null,null,null,null,null,null,"CUMBITARA",233,52,"NARIÑO"]
[null,null,null,null,null,null,null,null,null,null,null,null,null,null,null,null,null,null,null,null,null,"CUNDAY",226,73,"TOLIMA"]
[null,null,null,null,null,null,null,null,null,null,null,null,null,null,null,null,null,null,null,null,null,"CURITI",229,68,"SANTANDER"]
[null,null,null,null,null,null,null,null,null,null,null,null,null,null,null,null,null,null,null,null,null,"CURRILLO",205,18,"CAQUETA"]
[null,null,null,null,null,null,null,null,null,null,null,null,null,null,null,null,null,null,null,null,null,"CURUMANI",228,20,"CESAR"]
[null,null,null,null,null,null,null,null,null,null,null,null,null,null,null,null,null,null,null,null,null,"DABEIBA",234,5,"ANTIOQUIA"]
[null,null,null,null,null,null,null,null,null,null,null,null,null,null,null,null,null,null,null,null,null,"DAGUA",233,76,"VALLE DEL CAUCA"]
[null,null,null,null,null,null,null,null,null,null,null,null,null,null,null,null,null,null,null,null,null,"DIBULLA",90,44,"LA GUAJIRA"]
[null,null,null,null,null,null,null,null,null,null,null,null,null,null,null,null,null,null,null,null,null,"DISTRACCION",98,44,"LA GUAJIRA"]
[null,null,null,null,null,null,null,null,null,null,null,null,null,null,null,null,null,null,null,null,null,"DOLORES",236,73,"TOLIMA"]
[null,null,null,null,null,null,null,null,null,null,null,null,null,null,null,null,null,null,null,null,null,"DON MATIAS",237,5,"ANTIOQUIA"]
[null,null,null,null,null,null,null,null,null,null,null,null,null,null,null,null,null,null,null,null,null,"DOS QUEBRADAS",170,66,"RISARALDA"]
[null,null,null,null,null,null,null,null,null,null,null,null,null,null,null,null,null,null,null,null,null,"DUITAMA",238,15,"BOYACA"]
[null,null,null,null,null,null,null,null,null,null,null,null,null,null,null,null,null,null,null,null,null,"DURANIA",239,54,"NORTE DE SANTANDER"]
[null,null,null,null,null,null,null,null,null,null,null,null,null,null,null,null,null,null,null,null,null,"EBEJICO",240,5,"ANTIOQUIA"]
[null,null,null,null,null,null,null,null,null,null,null,null,null,null,null,null,null,null,null,null,null,"EL AGUILA",243,76,"VALLE DEL CAUCA"]
[null,null,null,null,null,null,null,null,null,null,null,null,null,null,null,null,null,null,null,null,null,"EL BAGRE",250,5,"ANTIOQUIA"]
[null,null,null,null,null,null,null,null,null,null,null,null,null,null,null,null,null,null,null,null,null,"EL BANCO",245,47,"MAGDALENA"]
[null,null,null,null,null,null,null,null,null,null,null,null,null,null,null,null,null,null,null,null,null,"EL CAIRO",246,76,"VALLE DEL CAUCA"]
[null,null,null,null,null,null,null,null,null,null,null,null,null,null,null,null,null,null,null,null,null,"EL CALVARIO",245,50,"META"]
[null,null,null,null,null,null,null,null,null,null,null,null,null,null,null,null,null,null,null,null,null,"EL CARMEN",245,54,"NORTE DE SANTANDER"]
[null,null,null,null,null,null,null,null,null,null,null,null,null,null,null,null,null,null,null,null,null,"EL CARMEN DE ATRATO",245,27,"CHOCO"]
[null,null,null,null,null,null,null,null,null,null,null,null,null,null,null,null,null,null,null,null,null,"EL CARMEN DE BOLIVAR",244,13,"BOLIVAR"]
[null,null,null,null,null,null,null,null,null,null,null,null,null,null,null,null,null,null,null,null,null,"EL CARMEN DE CHUCURI",235,68,"SANTANDER"]
[null,null,null,null,null,null,null,null,null,null,null,null,null,null,null,null,null,null,null,null,null,"EL CASTILLO",251,50,"META"]
[null,null,null,null,null,null,null,null,null,null,null,null,null,null,null,null,null,null,null,null,null,"EL CERRITO",248,76,"VALLE DEL CAUCA"]
[null,null,null,null,null,null,null,null,null,null,null,null,null,null,null,null,null,null,null,null,null,"EL CHARCO",250,52,"NARIÑO"]
[null,null,null,null,null,null,null,null,null,null,null,null,null,null,null,null,null,null,null,null,null,"EL COCUY",244,15,"BOYACA"]
[null,null,null,null,null,null,null,null,null,null,null,null,null,null,null,null,null,null,null,null,null,"EL COLEGIO",245,25,"CUNDINAMARCA"]
[null,null,null,null,null,null,null,null,null,null,null,null,null,null,null,null,null,null,null,null,null,"EL COPEY",238,20,"CESAR"]
[null,null,null,null,null,null,null,null,null,null,null,null,null,null,null,null,null,null,null,null,null,"EL DONCELLO",247,18,"CAQUETA"]
[null,null,null,null,null,null,null,null,null,null,null,null,null,null,null,null,null,null,null,null,null,"EL DORADO",270,50,"META"]
[null,null,null,null,null,null,null,null,null,null,null,null,null,null,null,null,null,null,null,null,null,"EL DOVIO",250,76,"VALLE DEL CAUCA"]
[null,null,null,null,null,null,null,null,null,null,null,null,null,null,null,null,null,null,null,null,null,"EL ENCANTO",263,91,"AMAZONAS"]
[null,null,null,null,null,null,null,null,null,null,null,null,null,null,null,null,null,null,null,null,null,"EL ESPINO",248,15,"BOYACA"]
[null,null,null,null,null,null,null,null,null,null,null,null,null,null,null,null,null,null,null,null,null,"EL FLORIAN",271,68,"SANTANDER"]
[null,null,null,null,null,null,null,null,null,null,null,null,null,null,null,null,null,null,null,null,null,"EL GUACAMAYO",245,68,"SANTANDER"]
[null,null,null,null,null,null,null,null,null,null,null,null,null,null,null,null,null,null,null,null,null,"EL GUAMO",248,13,"BOLIVAR"]
[null,null,null,null,null,null,null,null,null,null,null,null,null,null,null,null,null,null,null,null,null,"EL LITORAL DEL SAN JUAN",250,27,"CHOCO"]
[null,null,null,null,null,null,null,null,null,null,null,null,null,null,null,null,null,null,null,null,null,"EL MOLINO",110,44,"LA GUAJIRA"]
[null,null,null,null,null,null,null,null,null,null,null,null,null,null,null,null,null,null,null,null,null,"EL PASO",250,20,"CESAR"]
[null,null,null,null,null,null,null,null,null,null,null,null,null,null,null,null,null,null,null,null,null,"EL PAUJIL",256,18,"CAQUETA"]
[null,null,null,null,null,null,null,null,null,null,null,null,null,null,null,null,null,null,null,null,null,"EL PENOL",254,52,"NARIÑO"]
[null,null,null,null,null,null,null,null,null,null,null,null,null,null,null,null,null,null,null,null,null,"EL PENON",268,13,"BOLIVAR"]
[null,null,null,null,null,null,null,null,null,null,null,null,null,null,null,null,null,null,null,null,null,"EL PEÑON",258,25,"CUNDINAMARCA"]
[null,null,null,null,null,null,null,null,null,null,null,null,null,null,null,null,null,null,null,null,null,"EL PEÑON",250,68,"SANTANDER"]
[null,null,null,null,null,null,null,null,null,null,null,null,null,null,null,null,null,null,null,null,null,"EL PIÑON",258,47,"MAGDALENA"]
[null,null,null,null,null,null,null,null,null,null,null,null,null,null,null,null,null,null,null,null,null,"EL PLAYON",255,68,"SANTANDER"]
[null,null,null,null,null,null,null,null,null,null,null,null,null,null,null,null,null,null,null,null,null,"EL RETEN",268,47,"MAGDALENA"]
[null,null,null,null,null,null,null,null,null,null,null,null,null,null,null,null,null,null,null,null,null,"EL RETORNO",25,95,"GUAVIARE"]
[null,null,null,null,null,null,null,null,null,null,null,null,null,null,null,null,null,null,null,null,null,"EL ROBLE",233,70,"SUCRE"]
[null,null,null,null,null,null,null,null,null,null,null,null,null,null,null,null,null,null,null,null,null,"EL ROSAL",260,25,"CUNDINAMARCA"]
[null,null,null,null,null,null,null,null,null,null,null,null,null,null,null,null,null,null,null,null,null,"EL ROSARIO",256,52,"NARIÑO"]
[null,null,null,null,null,null,null,null,null,null,null,null,null,null,null,null,null,null,null,null,null,"EL TABLÓN DE GÓMEZ",258,52,"NARIÑO"]
[null,null,null,null,null,null,null,null,null,null,null,null,null,null,null,null,null,null,null,null,null,"EL TAMBO",256,19,"CAUCA"]
[null,null,null,null,null,null,null,null,null,null,null,null,null,null,null,null,null,null,null,null,null,"EL TAMBO",260,52,"NARIÑO"]
[null,null,null,null,null,null,null,null,null,null,null,null,null,null,null,null,null,null,null,null,null,"EL TARRA",250,54,"NORTE DE SANTANDER"]
[null,null,null,null,null,null,null,null,null,null,null,null,null,null,null,null,null,null,null,null,null,"EL ZULIA",261,54,"NORTE DE SANTANDER"]
[null,null,null,null,null,null,null,null,null,null,null,null,null,null,null,null,null,null,null,null,null,"ELIAS",244,41,"HUILA"]
[null,null,null,null,null,null,null,null,null,null,null,null,null,null,null,null,null,null,null,null,null,"ENCINO",264,68,"SANTANDER"]
[null,null,null,null,null,null,null,null,null,null,null,null,null,null,null,null,null,null,null,null,null,"ENCISO",266,68,"SANTANDER"]
[null,null,null,null,null,null,null,null,null,null,null,null,null,null,null,null,null,null,null,null,null,"ENTRERRIOS",264,5,"ANTIOQUIA"]
[null,null,null,null,null,null,null,null,null,null,null,null,null,null,null,null,null,null,null,null,null,"ENVIGADO",266,5,"ANTIOQUIA"]
[null,null,null,null,null,null,null,null,null,null,null,null,null,null,null,null,null,null,null,null,null,"ESPINAL",268,73,"TOLIMA"]
[null,null,null,null,null,null,null,null,null,null,null,null,null,null,null,null,null,null,null,null,null,"FACATATIVA",269,25,"CUNDINAMARCA"]
[null,null,null,null,null,null,null,null,null,null,null,null,null,null,null,null,null,null,null,null,null,"FALAN",270,73,"TOLIMA"]
[null,null,null,null,null,null,null,null,null,null,null,null,null,null,null,null,null,null,null,null,null,"FILADELFIA",272,17,"CALDAS"]
[null,null,null,null,null,null,null,null,null,null,null,null,null,null,null,null,null,null,null,null,null,"FILANDIA",272,63,"QUINDIO"]
[null,null,null,null,null,null,null,null,null,null,null,null,null,null,null,null,null,null,null,null,null,"FIRAVITOBA",272,15,"BOYACA"]
[null,null,null,null,null,null,null,null,null,null,null,null,null,null,null,null,null,null,null,null,null,"FLANDES",275,73,"TOLIMA"]
[null,null,null,null,null,null,null,null,null,null,null,null,null,null,null,null,null,null,null,null,null,"FLORENCIA",1,18,"CAQUETA"]
[null,null,null,null,null,null,null,null,null,null,null,null,null,null,null,null,null,null,null,null,null,"FLORENCIA",290,19,"CAUCA"]
[null,null,null,null,null,null,null,null,null,null,null,null,null,null,null,null,null,null,null,null,null,"FLORESTA",276,15,"BOYACA"]
[null,null,null,null,null,null,null,null,null,null,null,null,null,null,null,null,null,null,null,null,null,"FLORIDA",275,76,"VALLE DEL CAUCA"]
[null,null,null,null,null,null,null,null,null,null,null,null,null,null,null,null,null,null,null,null,null,"FLORIDABLANCA",276,68,"SANTANDER"]
[null,null,null,null,null,null,null,null,null,null,null,null,null,null,null,null,null,null,null,null,null,"FOMEQUE",279,25,"CUNDINAMARCA"]
[null,null,null,null,null,null,null,null,null,null,null,null,null,null,null,null,null,null,null,null,null,"FONSECA",279,44,"LA GUAJIRA"]
[null,null,null,null,null,null,null,null,null,null,null,null,null,null,null,null,null,null,null,null,null,"FORTUL",300,81,"ARAUCA"]
[null,null,null,null,null,null,null,null,null,null,null,null,null,null,null,null,null,null,null,null,null,"FOSCA",281,25,"CUNDINAMARCA"]
[null,null,null,null,null,null,null,null,null,null,null,null,null,null,null,null,null,null,null,null,null,"FRANCISCO PIZARRO",520,52,"NARIÑO"]
[null,null,null,null,null,null,null,null,null,null,null,null,null,null,null,null,null,null,null,null,null,"FREDONIA",282,5,"ANTIOQUIA"]
[null,null,null,null,null,null,null,null,null,null,null,null,null,null,null,null,null,null,null,null,null,"FRESNO",283,73,"TOLIMA"]
[null,null,null,null,null,null,null,null,null,null,null,null,null,null,null,null,null,null,null,null,null,"FRONTINO",284,5,"ANTIOQUIA"]
[null,null,null,null,null,null,null,null,null,null,null,null,null,null,null,null,null,null,null,null,null,"FUENTE DE ORO",287,50,"META"]
[null,null,null,null,null,null,null,null,null,null,null,null,null,null,null,null,null,null,null,null,null,"FUNDACION",288,47,"MAGDALENA"]
[null,null,null,null,null,null,null,null,null,null,null,null,null,null,null,null,null,null,null,null,null,"FUNES",287,52,"NARIÑO"]
[null,null,null,null,null,null,null,null,null,null,null,null,null,null,null,null,null,null,null,null,null,"FUNZA",286,25,"CUNDINAMARCA"]
[null,null,null,null,null,null,null,null,null,null,null,null,null,null,null,null,null,null,null,null,null,"FUQUENE",288,25,"CUNDINAMARCA"]
[null,null,null,null,null,null,null,null,null,null,null,null,null,null,null,null,null,null,null,null,null,"FUSAGASUGA",290,25,"CUNDINAMARCA"]
[null,null,null,null,null,null,null,null,null,null,null,null,null,null,null,null,null,null,null,null,null,"GACHALA",293,25,"CUNDINAMARCA"]
[null,null,null,null,null,null,null,null,null,null,null,null,null,null,null,null,null,null,null,null,null,"GACHANCIPA",295,25,"CUNDINAMARCA"]
[null,null,null,null,null,null,null,null,null,null,null,null,null,null,null,null,null,null,null,null,null,"GACHANTIVA",293,15,"BOYACA"]
[null,null,null,null,null,null,null,null,null,null,null,null,null,null,null,null,null,null,null,null,null,"GACHETA",297,25,"CUNDINAMARCA"]
[null,null,null,null,null,null,null,null,null,null,null,null,null,null,null,null,null,null,null,null,null,"GALAN",296,68,"SANTANDER"]
[null,null,null,null,null,null,null,null,null,null,null,null,null,null,null,null,null,null,null,null,null,"GALAPA",296,8,"ATLANTICO"]
[null,null,null,null,null,null,null,null,null,null,null,null,null,null,null,null,null,null,null,null,null,"GALERAS",235,70,"SUCRE"]
[null,null,null,null,null,null,null,null,null,null,null,null,null,null,null,null,null,null,null,null,null,"GAMA",299,25,"CUNDINAMARCA"]
[null,null,null,null,null,null,null,null,null,null,null,null,null,null,null,null,null,null,null,null,null,"GAMARRA",295,20,"CESAR"]
[null,null,null,null,null,null,null,null,null,null,null,null,null,null,null,null,null,null,null,null,null,"GAMBITA",298,68,"SANTANDER"]
[null,null,null,null,null,null,null,null,null,null,null,null,null,null,null,null,null,null,null,null,null,"GAMEZA",296,15,"BOYACA"]
[null,null,null,null,null,null,null,null,null,null,null,null,null,null,null,null,null,null,null,null,null,"GARAGOA",299,15,"BOYACA"]
[null,null,null,null,null,null,null,null,null,null,null,null,null,null,null,null,null,null,null,null,null,"GARZON",298,41,"HUILA"]
[null,null,null,null,null,null,null,null,null,null,null,null,null,null,null,null,null,null,null,null,null,"GENOVA",302,63,"QUINDIO"]
[null,null,null,null,null,null,null,null,null,null,null,null,null,null,null,null,null,null,null,null,null,"GIGANTE",306,41,"HUILA"]
[null,null,null,null,null,null,null,null,null,null,null,null,null,null,null,null,null,null,null,null,null,"GINEBRA",306,76,"VALLE DEL CAUCA"]
[null,null,null,null,null,null,null,null,null,null,null,null,null,null,null,null,null,null,null,null,null,"GIRALDO",306,5,"ANTIOQUIA"]
[null,null,null,null,null,null,null,null,null,null,null,null,null,null,null,null,null,null,null,null,null,"GIRARDOT",307,25,"CUNDINAMARCA"]
[null,null,null,null,null,null,null,null,null,null,null,null,null,null,null,null,null,null,null,null,null,"GIRARDOTA",308,5,"ANTIOQUIA"]
[null,null,null,null,null,null,null,null,null,null,null,null,null,null,null,null,null,null,null,null,null,"GIRON",307,68,"SANTANDER"]
[null,null,null,null,null,null,null,null,null,null,null,null,null,null,null,null,null,null,null,null,null,"GOMEZ PLATA",310,5,"ANTIOQUIA"]
[null,null,null,null,null,null,null,null,null,null,null,null,null,null,null,null,null,null,null,null,null,"GONZALEZ",310,20,"CESAR"]
[null,null,null,null,null,null,null,null,null,null,null,null,null,null,null,null,null,null,null,null,null,"GRAMALOTE",313,54,"NORTE DE SANTANDER"]
[null,null,null,null,null,null,null,null,null,null,null,null,null,null,null,null,null,null,null,null,null,"GRANADA",313,5,"ANTIOQUIA"]
[null,null,null,null,null,null,null,null,null,null,null,null,null,null,null,null,null,null,null,null,null,"GRANADA",312,25,"CUNDINAMARCA"]
[null,null,null,null,null,null,null,null,null,null,null,null,null,null,null,null,null,null,null,null,null,"GRANADA",313,50,"META"]
[null,null,null,null,null,null,null,null,null,null,null,null,null,null,null,null,null,null,null,null,null,"GUACA",318,68,"SANTANDER"]
[null,null,null,null,null,null,null,null,null,null,null,null,null,null,null,null,null,null,null,null,null,"GUACAMAYAS",317,15,"BOYACA"]
[null,null,null,null,null,null,null,null,null,null,null,null,null,null,null,null,null,null,null,null,null,"GUACARI",318,76,"VALLE DEL CAUCA"]
[null,null,null,null,null,null,null,null,null,null,null,null,null,null,null,null,null,null,null,null,null,"GUACHETA",317,25,"CUNDINAMARCA"]
[null,null,null,null,null,null,null,null,null,null,null,null,null,null,null,null,null,null,null,null,null,"GUACHUCAL",317,52,"NARIÑO"]
[null,null,null,null,null,null,null,null,null,null,null,null,null,null,null,null,null,null,null,null,null,"GUADALAJARA DE BUGA",111,76,"VALLE DEL CAUCA"]
[null,null,null,null,null,null,null,null,null,null,null,null,null,null,null,null,null,null,null,null,null,"GUADALUPE",315,5,"ANTIOQUIA"]
[null,null,null,null,null,null,null,null,null,null,null,null,null,null,null,null,null,null,null,null,null,"GUADALUPE",319,41,"HUILA"]
[null,null,null,null,null,null,null,null,null,null,null,null,null,null,null,null,null,null,null,null,null,"GUADALUPE",320,68,"SANTANDER"]
[null,null,null,null,null,null,null,null,null,null,null,null,null,null,null,null,null,null,null,null,null,"GUADUAS",320,25,"CUNDINAMARCA"]
[null,null,null,null,null,null,null,null,null,null,null,null,null,null,null,null,null,null,null,null,null,"GUAITARILLA",320,52,"NARIÑO"]
[null,null,null,null,null,null,null,null,null,null,null,null,null,null,null,null,null,null,null,null,null,"GUALMATAN",323,52,"NARIÑO"]
[null,null,null,null,null,null,null,null,null,null,null,null,null,null,null,null,null,null,null,null,null,"GUAMAL",318,47,"MAGDALENA"]
[null,null,null,null,null,null,null,null,null,null,null,null,null,null,null,null,null,null,null,null,null,"GUAMAL",318,50,"META"]
[null,null,null,null,null,null,null,null,null,null,null,null,null,null,null,null,null,null,null,null,null,"GUAMO",319,73,"TOLIMA"]
[null,null,null,null,null,null,null,null,null,null,null,null,null,null,null,null,null,null,null,null,null,"GUAPI",318,19,"CAUCA"]
[null,null,null,null,null,null,null,null,null,null,null,null,null,null,null,null,null,null,null,null,null,"GUAPOTA",322,68,"SANTANDER"]
[null,null,null,null,null,null,null,null,null,null,null,null,null,null,null,null,null,null,null,null,null,"GUARANDA",265,70,"SUCRE"]
[null,null,null,null,null,null,null,null,null,null,null,null,null,null,null,null,null,null,null,null,null,"GUARNE",318,5,"ANTIOQUIA"]
[null,null,null,null,null,null,null,null,null,null,null,null,null,null,null,null,null,null,null,null,null,"GUASCA",322,25,"CUNDINAMARCA"]
[null,null,null,null,null,null,null,null,null,null,null,null,null,null,null,null,null,null,null,null,null,"GUATAPE",321,5,"ANTIOQUIA"]
[null,null,null,null,null,null,null,null,null,null,null,null,null,null,null,null,null,null,null,null,null,"GUATAQUI",324,25,"CUNDINAMARCA"]
[null,null,null,null,null,null,null,null,null,null,null,null,null,null,null,null,null,null,null,null,null,"GUATAVITA",326,25,"CUNDINAMARCA"]
[null,null,null,null,null,null,null,null,null,null,null,null,null,null,null,null,null,null,null,null,null,"GUATEQUE",322,15,"BOYACA"]
[null,null,null,null,null,null,null,null,null,null,null,null,null,null,null,null,null,null,null,null,null,"GUATICA",318,66,"RISARALDA"]
[null,null,null,null,null,null,null,null,null,null,null,null,null,null,null,null,null,null,null,null,null,"GUAVATA",324,68,"SANTANDER"]
[null,null,null,null,null,null,null,null,null,null,null,null,null,null,null,null,null,null,null,null,null,"GUAYABAL DE SIQUIMA",328,25,"CUNDINAMARCA"]
[null,null,null,null,null,null,null,null,null,null,null,null,null,null,null,null,null,null,null,null,null,"GUAYABETAL",335,25,"CUNDINAMARCA"]
[null,null,null,null,null,null,null,null,null,null,null,null,null,null,null,null,null,null,null,null,null,"GUAYATA",325,15,"BOYACA"]
[null,null,null,null,null,null,null,null,null,null,null,null,null,null,null,null,null,null,null,null,null,"GÜEPSA",327,68,"SANTANDER"]
[null,null,null,null,null,null,null,null,null,null,null,null,null,null,null,null,null,null,null,null,null,"GUICAN",332,15,"BOYACA"]
[null,null,null,null,null,null,null,null,null,null,null,null,null,null,null,null,null,null,null,null,null,"GUTIERREZ",339,25,"CUNDINAMARCA"]
[null,null,null,null,null,null,null,null,null,null,null,null,null,null,null,null,null,null,null,null,null,"HACARI",344,54,"NORTE DE SANTANDER"]
[null,null,null,null,null,null,null,null,null,null,null,null,null,null,null,null,null,null,null,null,null,"HATILLO DE LOBA",300,13,"BOLIVAR"]
[null,null,null,null,null,null,null,null,null,null,null,null,null,null,null,null,null,null,null,null,null,"HATO",344,68,"SANTANDER"]
[null,null,null,null,null,null,null,null,null,null,null,null,null,null,null,null,null,null,null,null,null,"HATO COROZAL",125,85,"CASANARE"]
[null,null,null,null,null,null,null,null,null,null,null,null,null,null,null,null,null,null,null,null,null,"HATONUEVO",378,44,"LA GUAJIRA"]
[null,null,null,null,null,null,null,null,null,null,null,null,null,null,null,null,null,null,null,null,null,"HELICONIA",347,5,"ANTIOQUIA"]
[null,null,null,null,null,null,null,null,null,null,null,null,null,null,null,null,null,null,null,null,null,"HERRAN",347,54,"NORTE DE SANTANDER"]
[null,null,null,null,null,null,null,null,null,null,null,null,null,null,null,null,null,null,null,null,null,"HERVEO",347,73,"TOLIMA"]
[null,null,null,null,null,null,null,null,null,null,null,null,null,null,null,null,null,null,null,null,null,"HISPANIA",353,5,"ANTIOQUIA"]
[null,null,null,null,null,null,null,null,null,null,null,null,null,null,null,null,null,null,null,null,null,"HOBO",349,41,"HUILA"]
[null,null,null,null,null,null,null,null,null,null,null,null,null,null,null,null,null,null,null,null,null,"HONDA",349,73,"TOLIMA"]
[null,null,null,null,null,null,null,null,null,null,null,null,null,null,null,null,null,null,null,null,null,"IBAGUE",1,73,"TOLIMA"]
[null,null,null,null,null,null,null,null,null,null,null,null,null,null,null,null,null,null,null,null,null,"ICONONZO",352,73,"TOLIMA"]
[null,null,null,null,null,null,null,null,null,null,null,null,null,null,null,null,null,null,null,null,null,"ILES",352,52,"NARIÑO"]
[null,null,null,null,null,null,null,null,null,null,null,null,null,null,null,null,null,null,null,null,null,"IMUES",354,52,"NARIÑO"]
[null,null,null,null,null,null,null,null,null,null,null,null,null,null,null,null,null,null,null,null,null,"INIRIDA",1,94,"GUAINIA"]
[null,null,null,null,null,null,null,null,null,null,null,null,null,null,null,null,null,null,null,null,null,"INZA",355,19,"CAUCA"]
[null,null,null,null,null,null,null,null,null,null,null,null,null,null,null,null,null,null,null,null,null,"IPIALES",356,52,"NARIÑO"]
[null,null,null,null,null,null,null,null,null,null,null,null,null,null,null,null,null,null,null,null,null,"IQUIRA",357,41,"HUILA"]
[null,null,null,null,null,null,null,null,null,null,null,null,null,null,null,null,null,null,null,null,null,"ISNOS",359,41,"HUILA"]
[null,null,null,null,null,null,null,null,null,null,null,null,null,null,null,null,null,null,null,null,null,"ITAGUI",360,5,"ANTIOQUIA"]
[null,null,null,null,null,null,null,null,null,null,null,null,null,null,null,null,null,null,null,null,null,"ITSMINA",361,27,"CHOCO"]
[null,null,null,null,null,null,null,null,null,null,null,null,null,null,null,null,null,null,null,null,null,"ITUANGO",361,5,"ANTIOQUIA"]
[null,null,null,null,null,null,null,null,null,null,null,null,null,null,null,null,null,null,null,null,null,"IZA",362,15,"BOYACA"]
[null,null,null,null,null,null,null,null,null,null,null,null,null,null,null,null,null,null,null,null,null,"JAMBALO",364,19,"CAUCA"]
[null,null,null,null,null,null,null,null,null,null,null,null,null,null,null,null,null,null,null,null,null,"JAMUNDI",364,76,"VALLE DEL CAUCA"]
[null,null,null,null,null,null,null,null,null,null,null,null,null,null,null,null,null,null,null,null,null,"JARDIN",364,5,"ANTIOQUIA"]
[null,null,null,null,null,null,null,null,null,null,null,null,null,null,null,null,null,null,null,null,null,"JENESANO",367,15,"BOYACA"]
[null,null,null,null,null,null,null,null,null,null,null,null,null,null,null,null,null,null,null,null,null,"JERICO",368,5,"ANTIOQUIA"]
[null,null,null,null,null,null,null,null,null,null,null,null,null,null,null,null,null,null,null,null,null,"JERICO",368,15,"BOYACA"]
[null,null,null,null,null,null,null,null,null,null,null,null,null,null,null,null,null,null,null,null,null,"JERUSALEN",368,25,"CUNDINAMARCA"]
[null,null,null,null,null,null,null,null,null,null,null,null,null,null,null,null,null,null,null,null,null,"JESUS MARIA",368,68,"SANTANDER"]
[null,null,null,null,null,null,null,null,null,null,null,null,null,null,null,null,null,null,null,null,null,"JORDAN",370,68,"SANTANDER"]
[null,null,null,null,null,null,null,null,null,null,null,null,null,null,null,null,null,null,null,null,null,"JUAN DE ACOSTA",372,8,"ATLANTICO"]
[null,null,null,null,null,null,null,null,null,null,null,null,null,null,null,null,null,null,null,null,null,"JUNIN",372,25,"CUNDINAMARCA"]
[null,null,null,null,null,null,null,null,null,null,null,null,null,null,null,null,null,null,null,null,null,"JURADO",372,27,"CHOCO"]
[null,null,null,null,null,null,null,null,null,null,null,null,null,null,null,null,null,null,null,null,null,"LA APARTADA",350,23,"CORDOBA"]
[null,null,null,null,null,null,null,null,null,null,null,null,null,null,null,null,null,null,null,null,null,"LA ARGENTINA",378,41,"HUILA"]
[null,null,null,null,null,null,null,null,null,null,null,null,null,null,null,null,null,null,null,null,null,"LA BELLEZA",377,68,"SANTANDER"]
[null,null,null,null,null,null,null,null,null,null,null,null,null,null,null,null,null,null,null,null,null,"LA CALERA",377,25,"CUNDINAMARCA"]
[null,null,null,null,null,null,null,null,null,null,null,null,null,null,null,null,null,null,null,null,null,"LA CAPILLA",380,15,"BOYACA"]
[null,null,null,null,null,null,null,null,null,null,null,null,null,null,null,null,null,null,null,null,null,"LA CEJA",376,5,"ANTIOQUIA"]
[null,null,null,null,null,null,null,null,null,null,null,null,null,null,null,null,null,null,null,null,null,"LA CELIA",383,66,"RISARALDA"]
[null,null,null,null,null,null,null,null,null,null,null,null,null,null,null,null,null,null,null,null,null,"LA CHORRERA",405,91,"AMAZONAS"]
[null,null,null,null,null,null,null,null,null,null,null,null,null,null,null,null,null,null,null,null,null,"LA CRUZ",378,52,"NARIÑO"]
[null,null,null,null,null,null,null,null,null,null,null,null,null,null,null,null,null,null,null,null,null,"LA CUMBRE",377,76,"VALLE DEL CAUCA"]
[null,null,null,null,null,null,null,null,null,null,null,null,null,null,null,null,null,null,null,null,null,"LA DORADA",380,17,"CALDAS"]
[null,null,null,null,null,null,null,null,null,null,null,null,null,null,null,null,null,null,null,null,null,"LA ESPERANZA",385,54,"NORTE DE SANTANDER"]
[null,null,null,null,null,null,null,null,null,null,null,null,null,null,null,null,null,null,null,null,null,"LA ESTRELLA",380,5,"ANTIOQUIA"]
[null,null,null,null,null,null,null,null,null,null,null,null,null,null,null,null,null,null,null,null,null,"LA FLORIDA",381,52,"NARIÑO"]
[null,null,null,null,null,null,null,null,null,null,null,null,null,null,null,null,null,null,null,null,null,"LA GLORIA",383,20,"CESAR"]
[null,null,null,null,null,null,null,null,null,null,null,null,null,null,null,null,null,null,null,null,null,"LA GUADALUPE",885,94,"GUAINIA"]
[null,null,null,null,null,null,null,null,null,null,null,null,null,null,null,null,null,null,null,null,null,"LA JAGUA DE IBIRICO",400,20,"CESAR"]
[null,null,null,null,null,null,null,null,null,null,null,null,null,null,null,null,null,null,null,null,null,"LA JAGUA DEL PILAR",420,44,"LA GUAJIRA"]
[null,null,null,null,null,null,null,null,null,null,null,null,null,null,null,null,null,null,null,null,null,"LA LLANADA",385,52,"NARIÑO"]
[null,null,null,null,null,null,null,null,null,null,null,null,null,null,null,null,null,null,null,null,null,"LA MACARENA",350,50,"META"]
[null,null,null,null,null,null,null,null,null,null,null,null,null,null,null,null,null,null,null,null,null,"LA MERCED",388,17,"CALDAS"]
[null,null,null,null,null,null,null,null,null,null,null,null,null,null,null,null,null,null,null,null,null,"LA MESA",386,25,"CUNDINAMARCA"]
[null,null,null,null,null,null,null,null,null,null,null,null,null,null,null,null,null,null,null,null,null,"LA MONTAÑITA",410,18,"CAQUETA"]
[null,null,null,null,null,null,null,null,null,null,null,null,null,null,null,null,null,null,null,null,null,"LA PALMA",394,25,"CUNDINAMARCA"]
[null,null,null,null,null,null,null,null,null,null,null,null,null,null,null,null,null,null,null,null,null,"LA PAZ",621,20,"CESAR"]
[null,null,null,null,null,null,null,null,null,null,null,null,null,null,null,null,null,null,null,null,null,"LA PAZ",397,68,"SANTANDER"]
[null,null,null,null,null,null,null,null,null,null,null,null,null,null,null,null,null,null,null,null,null,"LA PEDRERA",407,91,"AMAZONAS"]
[null,null,null,null,null,null,null,null,null,null,null,null,null,null,null,null,null,null,null,null,null,"LA PEÑA",398,25,"CUNDINAMARCA"]
[null,null,null,null,null,null,null,null,null,null,null,null,null,null,null,null,null,null,null,null,null,"LA PINTADA",390,5,"ANTIOQUIA"]
[null,null,null,null,null,null,null,null,null,null,null,null,null,null,null,null,null,null,null,null,null,"LA PLATA",396,41,"HUILA"]
[null,null,null,null,null,null,null,null,null,null,null,null,null,null,null,null,null,null,null,null,null,"LA PLAYA",398,54,"NORTE DE SANTANDER"]
[null,null,null,null,null,null,null,null,null,null,null,null,null,null,null,null,null,null,null,null,null,"LA PRIMAVERA",524,99,"VICHADA"]
[null,null,null,null,null,null,null,null,null,null,null,null,null,null,null,null,null,null,null,null,null,"LA SALINA",136,85,"CASANARE"]
[null,null,null,null,null,null,null,null,null,null,null,null,null,null,null,null,null,null,null,null,null,"LA SIERRA",392,19,"CAUCA"]
[null,null,null,null,null,null,null,null,null,null,null,null,null,null,null,null,null,null,null,null,null,"LA TEBAIDA",401,63,"QUINDIO"]
[null,null,null,null,null,null,null,null,null,null,null,null,null,null,null,null,null,null,null,null,null,"LA TOLA",390,52,"NARIÑO"]
[null,null,null,null,null,null,null,null,null,null,null,null,null,null,null,null,null,null,null,null,null,"LA UNION",400,5,"ANTIOQUIA"]
[null,null,null,null,null,null,null,null,null,null,null,null,null,null,null,null,null,null,null,null,null,"LA UNION",399,52,"NARIÑO"]
[null,null,null,null,null,null,null,null,null,null,null,null,null,null,null,null,null,null,null,null,null,"LA UNION",400,70,"SUCRE"]
[null,null,null,null,null,null,null,null,null,null,null,null,null,null,null,null,null,null,null,null,null,"LA UNION",400,76,"VALLE DEL CAUCA"]
[null,null,null,null,null,null,null,null,null,null,null,null,null,null,null,null,null,null,null,null,null,"LA URIBE",370,50,"META"]
[null,null,null,null,null,null,null,null,null,null,null,null,null,null,null,null,null,null,null,null,null,"LA UVITA",403,15,"BOYACA"]
[null,null,null,null,null,null,null,null,null,null,null,null,null,null,null,null,null,null,null,null,null,"LA VEGA",397,19,"CAUCA"]
[null,null,null,null,null,null,null,null,null,null,null,null,null,null,null,null,null,null,null,null,null,"LA VEGA",402,25,"CUNDINAMARCA"]
[null,null,null,null,null,null,null,null,null,null,null,null,null,null,null,null,null,null,null,null,null,"LA VICTORIA",401,15,"BOYACA"]
[null,null,null,null,null,null,null,null,null,null,null,null,null,null,null,null,null,null,null,null,null,"LA VICTORIA",403,76,"VALLE DEL CAUCA"]
[null,null,null,null,null,null,null,null,null,null,null,null,null,null,null,null,null,null,null,null,null,"LA VICTORIA",430,91,"AMAZONAS"]
[null,null,null,null,null,null,null,null,null,null,null,null,null,null,null,null,null,null,null,null,null,"LA VIRGINIA",400,66,"RISARALDA"]
[null,null,null,null,null,null,null,null,null,null,null,null,null,null,null,null,null,null,null,null,null,"LABATECA",377,54,"NORTE DE SANTANDER"]
[null,null,null,null,null,null,null,null,null,null,null,null,null,null,null,null,null,null,null,null,null,"LABRANZAGRANDE",377,15,"BOYACA"]
[null,null,null,null,null,null,null,null,null,null,null,null,null,null,null,null,null,null,null,null,null,"LANDAZURI",385,68,"SANTANDER"]
[null,null,null,null,null,null,null,null,null,null,null,null,null,null,null,null,null,null,null,null,null,"LEBRIJA",406,68,"SANTANDER"]
[null,null,null,null,null,null,null,null,null,null,null,null,null,null,null,null,null,null,null,null,null,"LEGUÍZAMO",573,86,"PUTUMAYO"]
[null,null,null,null,null,null,null,null,null,null,null,null,null,null,null,null,null,null,null,null,null,"LEIVA",405,52,"NARIÑO"]
[null,null,null,null,null,null,null,null,null,null,null,null,null,null,null,null,null,null,null,null,null,"LEJANIAS",400,50,"META"]
[null,null,null,null,null,null,null,null,null,null,null,null,null,null,null,null,null,null,null,null,null,"LENGUAZAQUE",407,25,"CUNDINAMARCA"]
[null,null,null,null,null,null,null,null,null,null,null,null,null,null,null,null,null,null,null,null,null,"LERIDA",408,73,"TOLIMA"]
[null,null,null,null,null,null,null,null,null,null,null,null,null,null,null,null,null,null,null,null,null,"LETICIA",1,91,"AMAZONAS"]
[null,null,null,null,null,null,null,null,null,null,null,null,null,null,null,null,null,null,null,null,null,"LIBANO",411,73,"TOLIMA"]
[null,null,null,null,null,null,null,null,null,null,null,null,null,null,null,null,null,null,null,null,null,"LIBORINA",411,5,"ANTIOQUIA"]
[null,null,null,null,null,null,null,null,null,null,null,null,null,null,null,null,null,null,null,null,null,"LINARES",411,52,"NARIÑO"]
[null,null,null,null,null,null,null,null,null,null,null,null,null,null,null,null,null,null,null,null,null,"LLORO",413,27,"CHOCO"]
[null,null,null,null,null,null,null,null,null,null,null,null,null,null,null,null,null,null,null,null,null,"LOPEZ",418,19,"CAUCA"]
[null,null,null,null,null,null,null,null,null,null,null,null,null,null,null,null,null,null,null,null,null,"LORICA",417,23,"CORDOBA"]
[null,null,null,null,null,null,null,null,null,null,null,null,null,null,null,null,null,null,null,null,null,"LOS ANDES",418,52,"NARIÑO"]
[null,null,null,null,null,null,null,null,null,null,null,null,null,null,null,null,null,null,null,null,null,"LOS CORDOBAS",419,23,"CORDOBA"]
[null,null,null,null,null,null,null,null,null,null,null,null,null,null,null,null,null,null,null,null,null,"LOS PALMITOS",418,70,"SUCRE"]
[null,null,null,null,null,null,null,null,null,null,null,null,null,null,null,null,null,null,null,null,null,"LOS PATIOS",405,54,"NORTE DE SANTANDER"]
[null,null,null,null,null,null,null,null,null,null,null,null,null,null,null,null,null,null,null,null,null,"LOS SANTOS",418,68,"SANTANDER"]
[null,null,null,null,null,null,null,null,null,null,null,null,null,null,null,null,null,null,null,null,null,"LOURDES",418,54,"NORTE DE SANTANDER"]
[null,null,null,null,null,null,null,null,null,null,null,null,null,null,null,null,null,null,null,null,null,"LURUACO",421,8,"ATLANTICO"]
[null,null,null,null,null,null,null,null,null,null,null,null,null,null,null,null,null,null,null,null,null,"MACANAL",425,15,"BOYACA"]
[null,null,null,null,null,null,null,null,null,null,null,null,null,null,null,null,null,null,null,null,null,"MACARAVITA",425,68,"SANTANDER"]
[null,null,null,null,null,null,null,null,null,null,null,null,null,null,null,null,null,null,null,null,null,"MACEO",425,5,"ANTIOQUIA"]
[null,null,null,null,null,null,null,null,null,null,null,null,null,null,null,null,null,null,null,null,null,"MACHETA",426,25,"CUNDINAMARCA"]
[null,null,null,null,null,null,null,null,null,null,null,null,null,null,null,null,null,null,null,null,null,"MADRID",430,25,"CUNDINAMARCA"]
[null,null,null,null,null,null,null,null,null,null,null,null,null,null,null,null,null,null,null,null,null,"MAGANGUE",430,13,"BOLIVAR"]
[null,null,null,null,null,null,null,null,null,null,null,null,null,null,null,null,null,null,null,null,null,"MAGUI",427,52,"NARIÑO"]
[null,null,null,null,null,null,null,null,null,null,null,null,null,null,null,null,null,null,null,null,null,"MAHATES",433,13,"BOLIVAR"]
[null,null,null,null,null,null,null,null,null,null,null,null,null,null,null,null,null,null,null,null,null,"MAICAO",430,44,"LA GUAJIRA"]
[null,null,null,null,null,null,null,null,null,null,null,null,null,null,null,null,null,null,null,null,null,"MAJAGUAL",429,70,"SUCRE"]
[null,null,null,null,null,null,null,null,null,null,null,null,null,null,null,null,null,null,null,null,null,"MALAGA",432,68,"SANTANDER"]
[null,null,null,null,null,null,null,null,null,null,null,null,null,null,null,null,null,null,null,null,null,"MALAMBO",433,8,"ATLANTICO"]
[null,null,null,null,null,null,null,null,null,null,null,null,null,null,null,null,null,null,null,null,null,"MALLAMA",435,52,"NARIÑO"]
[null,null,null,null,null,null,null,null,null,null,null,null,null,null,null,null,null,null,null,null,null,"MANATI",436,8,"ATLANTICO"]
[null,null,null,null,null,null,null,null,null,null,null,null,null,null,null,null,null,null,null,null,null,"MANAURE",443,20,"CESAR"]
[null,null,null,null,null,null,null,null,null,null,null,null,null,null,null,null,null,null,null,null,null,"MANAURE",560,44,"LA GUAJIRA"]
[null,null,null,null,null,null,null,null,null,null,null,null,null,null,null,null,null,null,null,null,null,"MANI",139,85,"CASANARE"]
[null,null,null,null,null,null,null,null,null,null,null,null,null,null,null,null,null,null,null,null,null,"MANIZALES",1,17,"CALDAS"]
[null,null,null,null,null,null,null,null,null,null,null,null,null,null,null,null,null,null,null,null,null,"MANTA",436,25,"CUNDINAMARCA"]
[null,null,null,null,null,null,null,null,null,null,null,null,null,null,null,null,null,null,null,null,null,"MANZANARES",433,17,"CALDAS"]
[null,null,null,null,null,null,null,null,null,null,null,null,null,null,null,null,null,null,null,null,null,"MAPIRIPAN",325,50,"META"]
[null,null,null,null,null,null,null,null,null,null,null,null,null,null,null,null,null,null,null,null,null,"MAPIRIPANA",663,94,"GUAINIA"]
[null,null,null,null,null,null,null,null,null,null,null,null,null,null,null,null,null,null,null,null,null,"MARGARITA",440,13,"BOLIVAR"]
[null,null,null,null,null,null,null,null,null,null,null,null,null,null,null,null,null,null,null,null,null,"MARIA LA BAJA",442,13,"BOLIVAR"]
[null,null,null,null,null,null,null,null,null,null,null,null,null,null,null,null,null,null,null,null,null,"MARINILLA",440,5,"ANTIOQUIA"]
[null,null,null,null,null,null,null,null,null,null,null,null,null,null,null,null,null,null,null,null,null,"MARIPI",442,15,"BOYACA"]
[null,null,null,null,null,null,null,null,null,null,null,null,null,null,null,null,null,null,null,null,null,"MARIQUITA",443,73,"TOLIMA"]
[null,null,null,null,null,null,null,null,null,null,null,null,null,null,null,null,null,null,null,null,null,"MARMATO",442,17,"CALDAS"]
[null,null,null,null,null,null,null,null,null,null,null,null,null,null,null,null,null,null,null,null,null,"MARQUETALIA",444,17,"CALDAS"]
[null,null,null,null,null,null,null,null,null,null,null,null,null,null,null,null,null,null,null,null,null,"MARSELLA",440,66,"RISARALDA"]
[null,null,null,null,null,null,null,null,null,null,null,null,null,null,null,null,null,null,null,null,null,"MARULANDA",446,17,"CALDAS"]
[null,null,null,null,null,null,null,null,null,null,null,null,null,null,null,null,null,null,null,null,null,"MATANZA",444,68,"SANTANDER"]
[null,null,null,null,null,null,null,null,null,null,null,null,null,null,null,null,null,null,null,null,null,"MEDELLIN",1,5,"ANTIOQUIA"]
[null,null,null,null,null,null,null,null,null,null,null,null,null,null,null,null,null,null,null,null,null,"MEDINA",438,25,"CUNDINAMARCA"]
[null,null,null,null,null,null,null,null,null,null,null,null,null,null,null,null,null,null,null,null,null,"MEDIO ATRATO",425,27,"CHOCO"]
[null,null,null,null,null,null,null,null,null,null,null,null,null,null,null,null,null,null,null,null,null,"MEDIO BAUDO",430,27,"CHOCO"]
[null,null,null,null,null,null,null,null,null,null,null,null,null,null,null,null,null,null,null,null,null,"MEDIO SAN JUAN",450,27,"CHOCO"]
[null,null,null,null,null,null,null,null,null,null,null,null,null,null,null,null,null,null,null,null,null,"MELGAR",449,73,"TOLIMA"]
[null,null,null,null,null,null,null,null,null,null,null,null,null,null,null,null,null,null,null,null,null,"MERCADERES",450,19,"CAUCA"]
[null,null,null,null,null,null,null,null,null,null,null,null,null,null,null,null,null,null,null,null,null,"MESETAS",330,50,"META"]
[null,null,null,null,null,null,null,null,null,null,null,null,null,null,null,null,null,null,null,null,null,"MILAN",460,18,"CAQUETA"]
[null,null,null,null,null,null,null,null,null,null,null,null,null,null,null,null,null,null,null,null,null,"MIRAFLORES",455,15,"BOYACA"]
[null,null,null,null,null,null,null,null,null,null,null,null,null,null,null,null,null,null,null,null,null,"MIRAFLORES",200,95,"GUAVIARE"]
[null,null,null,null,null,null,null,null,null,null,null,null,null,null,null,null,null,null,null,null,null,"MIRANDA",455,19,"CAUCA"]
[null,null,null,null,null,null,null,null,null,null,null,null,null,null,null,null,null,null,null,null,null,"MIRITI-PARANA",460,91,"AMAZONAS"]
[null,null,null,null,null,null,null,null,null,null,null,null,null,null,null,null,null,null,null,null,null,"MISTRATO",456,66,"RISARALDA"]
[null,null,null,null,null,null,null,null,null,null,null,null,null,null,null,null,null,null,null,null,null,"MITU",1,97,"VAUPES"]
[null,null,null,null,null,null,null,null,null,null,null,null,null,null,null,null,null,null,null,null,null,"MOCOA",1,86,"PUTUMAYO"]
[null,null,null,null,null,null,null,null,null,null,null,null,null,null,null,null,null,null,null,null,null,"MOGOTES",464,68,"SANTANDER"]
[null,null,null,null,null,null,null,null,null,null,null,null,null,null,null,null,null,null,null,null,null,"MOLAGAVITA",468,68,"SANTANDER"]
[null,null,null,null,null,null,null,null,null,null,null,null,null,null,null,null,null,null,null,null,null,"MOMIL",464,23,"CORDOBA"]
[null,null,null,null,null,null,null,null,null,null,null,null,null,null,null,null,null,null,null,null,null,"MOMPOS",468,13,"BOLIVAR"]
[null,null,null,null,null,null,null,null,null,null,null,null,null,null,null,null,null,null,null,null,null,"MONGUA",464,15,"BOYACA"]
[null,null,null,null,null,null,null,null,null,null,null,null,null,null,null,null,null,null,null,null,null,"MONGUI",466,15,"BOYACA"]
[null,null,null,null,null,null,null,null,null,null,null,null,null,null,null,null,null,null,null,null,null,"MONIQUIRA",469,15,"BOYACA"]
[null,null,null,null,null,null,null,null,null,null,null,null,null,null,null,null,null,null,null,null,null,"MONTEBELLO",467,5,"ANTIOQUIA"]
[null,null,null,null,null,null,null,null,null,null,null,null,null,null,null,null,null,null,null,null,null,"MONTECRISTO",458,13,"BOLIVAR"]
[null,null,null,null,null,null,null,null,null,null,null,null,null,null,null,null,null,null,null,null,null,"MONTELIBANO",466,23,"CORDOBA"]
[null,null,null,null,null,null,null,null,null,null,null,null,null,null,null,null,null,null,null,null,null,"MONTENEGRO",470,63,"QUINDIO"]
[null,null,null,null,null,null,null,null,null,null,null,null,null,null,null,null,null,null,null,null,null,"MONTERIA",1,23,"CORDOBA"]
[null,null,null,null,null,null,null,null,null,null,null,null,null,null,null,null,null,null,null,null,null,"MONTERREY",162,85,"CASANARE"]
[null,null,null,null,null,null,null,null,null,null,null,null,null,null,null,null,null,null,null,null,null,"MOÑITOS",500,23,"CORDOBA"]
[null,null,null,null,null,null,null,null,null,null,null,null,null,null,null,null,null,null,null,null,null,"MORALES",473,13,"BOLIVAR"]
[null,null,null,null,null,null,null,null,null,null,null,null,null,null,null,null,null,null,null,null,null,"MORALES",473,19,"CAUCA"]
[null,null,null,null,null,null,null,null,null,null,null,null,null,null,null,null,null,null,null,null,null,"MORELIA",479,18,"CAQUETA"]
[null,null,null,null,null,null,null,null,null,null,null,null,null,null,null,null,null,null,null,null,null,"MORICHAL",888,94,"GUAINIA"]
[null,null,null,null,null,null,null,null,null,null,null,null,null,null,null,null,null,null,null,null,null,"MORROA",473,70,"SUCRE"]
[null,null,null,null,null,null,null,null,null,null,null,null,null,null,null,null,null,null,null,null,null,"MOSQUERA",473,25,"CUNDINAMARCA"]
[null,null,null,null,null,null,null,null,null,null,null,null,null,null,null,null,null,null,null,null,null,"MOSQUERA",473,52,"NARIÑO"]
[null,null,null,null,null,null,null,null,null,null,null,null,null,null,null,null,null,null,null,null,null,"MOTAVITA",476,15,"BOYACA"]
[null,null,null,null,null,null,null,null,null,null,null,null,null,null,null,null,null,null,null,null,null,"MURILLO",461,73,"TOLIMA"]
[null,null,null,null,null,null,null,null,null,null,null,null,null,null,null,null,null,null,null,null,null,"MURINDO",475,5,"ANTIOQUIA"]
[null,null,null,null,null,null,null,null,null,null,null,null,null,null,null,null,null,null,null,null,null,"MUTATA",480,5,"ANTIOQUIA"]
[null,null,null,null,null,null,null,null,null,null,null,null,null,null,null,null,null,null,null,null,null,"MUTISCUA",480,54,"NORTE DE SANTANDER"]
[null,null,null,null,null,null,null,null,null,null,null,null,null,null,null,null,null,null,null,null,null,"MUZO",480,15,"BOYACA"]
[null,null,null,null,null,null,null,null,null,null,null,null,null,null,null,null,null,null,null,null,null,"NARINO",480,52,"NARIÑO"]
[null,null,null,null,null,null,null,null,null,null,null,null,null,null,null,null,null,null,null,null,null,"NARIÑO",483,5,"ANTIOQUIA"]
[null,null,null,null,null,null,null,null,null,null,null,null,null,null,null,null,null,null,null,null,null,"NARIÑO",483,25,"CUNDINAMARCA"]
[null,null,null,null,null,null,null,null,null,null,null,null,null,null,null,null,null,null,null,null,null,"NATAGA",483,41,"HUILA"]
[null,null,null,null,null,null,null,null,null,null,null,null,null,null,null,null,null,null,null,null,null,"NATAGAIMA",483,73,"TOLIMA"]
[null,null,null,null,null,null,null,null,null,null,null,null,null,null,null,null,null,null,null,null,null,"NECHI",495,5,"ANTIOQUIA"]
[null,null,null,null,null,null,null,null,null,null,null,null,null,null,null,null,null,null,null,null,null,"NECOCLI",490,5,"ANTIOQUIA"]
[null,null,null,null,null,null,null,null,null,null,null,null,null,null,null,null,null,null,null,null,null,"NEIRA",486,17,"CALDAS"]
[null,null,null,null,null,null,null,null,null,null,null,null,null,null,null,null,null,null,null,null,null,"NEIVA",1,41,"HUILA"]
[null,null,null,null,null,null,null,null,null,null,null,null,null,null,null,null,null,null,null,null,null,"NEMOCON",486,25,"CUNDINAMARCA"]
[null,null,null,null,null,null,null,null,null,null,null,null,null,null,null,null,null,null,null,null,null,"NILO",488,25,"CUNDINAMARCA"]
[null,null,null,null,null,null,null,null,null,null,null,null,null,null,null,null,null,null,null,null,null,"NIMAIMA",489,25,"CUNDINAMARCA"]
[null,null,null,null,null,null,null,null,null,null,null,null,null,null,null,null,null,null,null,null,null,"NOBSA",491,15,"BOYACA"]
[null,null,null,null,null,null,null,null,null,null,null,null,null,null,null,null,null,null,null,null,null,"NOCAIMA",491,25,"CUNDINAMARCA"]
[null,null,null,null,null,null,null,null,null,null,null,null,null,null,null,null,null,null,null,null,null,"NORCASIA",495,17,"CALDAS"]
[null,null,null,null,null,null,null,null,null,null,null,null,null,null,null,null,null,null,null,null,null,"NOVITA",491,27,"CHOCO"]
[null,null,null,null,null,null,null,null,null,null,null,null,null,null,null,null,null,null,null,null,null,"NUEVA GRANADA",460,47,"MAGDALENA"]
[null,null,null,null,null,null,null,null,null,null,null,null,null,null,null,null,null,null,null,null,null,"NUEVO COLON",494,15,"BOYACA"]
[null,null,null,null,null,null,null,null,null,null,null,null,null,null,null,null,null,null,null,null,null,"NUNCHIA",225,85,"CASANARE"]
[null,null,null,null,null,null,null,null,null,null,null,null,null,null,null,null,null,null,null,null,null,"NUQUI",495,27,"CHOCO"]
[null,null,null,null,null,null,null,null,null,null,null,null,null,null,null,null,null,null,null,null,null,"OBANDO",497,76,"VALLE DEL CAUCA"]
[null,null,null,null,null,null,null,null,null,null,null,null,null,null,null,null,null,null,null,null,null,"OCAMONTE",498,68,"SANTANDER"]
[null,null,null,null,null,null,null,null,null,null,null,null,null,null,null,null,null,null,null,null,null,"OCAÑA",498,54,"NORTE DE SANTANDER"]
[null,null,null,null,null,null,null,null,null,null,null,null,null,null,null,null,null,null,null,null,null,"OIBA",500,68,"SANTANDER"]
[null,null,null,null,null,null,null,null,null,null,null,null,null,null,null,null,null,null,null,null,null,"OICATA",500,15,"BOYACA"]
[null,null,null,null,null,null,null,null,null,null,null,null,null,null,null,null,null,null,null,null,null,"OLAYA",501,5,"ANTIOQUIA"]
[null,null,null,null,null,null,null,null,null,null,null,null,null,null,null,null,null,null,null,null,null,"OLAYA HERRERA",490,52,"NARIÑO"]
[null,null,null,null,null,null,null,null,null,null,null,null,null,null,null,null,null,null,null,null,null,"ONZAGA",502,68,"SANTANDER"]
[null,null,null,null,null,null,null,null,null,null,null,null,null,null,null,null,null,null,null,null,null,"OPORAPA",503,41,"HUILA"]
[null,null,null,null,null,null,null,null,null,null,null,null,null,null,null,null,null,null,null,null,null,"ORITO",320,86,"PUTUMAYO"]
[null,null,null,null,null,null,null,null,null,null,null,null,null,null,null,null,null,null,null,null,null,"OROCUE",230,85,"CASANARE"]
[null,null,null,null,null,null,null,null,null,null,null,null,null,null,null,null,null,null,null,null,null,"ORTEGA",504,73,"TOLIMA"]
[null,null,null,null,null,null,null,null,null,null,null,null,null,null,null,null,null,null,null,null,null,"OSPINA",506,52,"NARIÑO"]
[null,null,null,null,null,null,null,null,null,null,null,null,null,null,null,null,null,null,null,null,null,"OTANCHE",507,15,"BOYACA"]
[null,null,null,null,null,null,null,null,null,null,null,null,null,null,null,null,null,null,null,null,null,"OVEJAS",508,70,"SUCRE"]
[null,null,null,null,null,null,null,null,null,null,null,null,null,null,null,null,null,null,null,null,null,"PACHAVITA",511,15,"BOYACA"]
[null,null,null,null,null,null,null,null,null,null,null,null,null,null,null,null,null,null,null,null,null,"PACHO",513,25,"CUNDINAMARCA"]
[null,null,null,null,null,null,null,null,null,null,null,null,null,null,null,null,null,null,null,null,null,"PACOA",511,97,"VAUPES"]
[null,null,null,null,null,null,null,null,null,null,null,null,null,null,null,null,null,null,null,null,null,"PACORA",513,17,"CALDAS"]
[null,null,null,null,null,null,null,null,null,null,null,null,null,null,null,null,null,null,null,null,null,"PADILLA",513,19,"CAUCA"]
[null,null,null,null,null,null,null,null,null,null,null,null,null,null,null,null,null,null,null,null,null,"PAEZ",514,15,"BOYACA"]
[null,null,null,null,null,null,null,null,null,null,null,null,null,null,null,null,null,null,null,null,null,"PAEZ",517,19,"CAUCA"]
[null,null,null,null,null,null,null,null,null,null,null,null,null,null,null,null,null,null,null,null,null,"PAICOL",518,41,"HUILA"]
[null,null,null,null,null,null,null,null,null,null,null,null,null,null,null,null,null,null,null,null,null,"PAILITAS",517,20,"CESAR"]
[null,null,null,null,null,null,null,null,null,null,null,null,null,null,null,null,null,null,null,null,null,"PAIME",518,25,"CUNDINAMARCA"]
[null,null,null,null,null,null,null,null,null,null,null,null,null,null,null,null,null,null,null,null,null,"PAIPA",516,15,"BOYACA"]
[null,null,null,null,null,null,null,null,null,null,null,null,null,null,null,null,null,null,null,null,null,"PAJARITO",518,15,"BOYACA"]
[null,null,null,null,null,null,null,null,null,null,null,null,null,null,null,null,null,null,null,null,null,"PALERMO",524,41,"HUILA"]
[null,null,null,null,null,null,null,null,null,null,null,null,null,null,null,null,null,null,null,null,null,"PALESTINA",524,17,"CALDAS"]
[null,null,null,null,null,null,null,null,null,null,null,null,null,null,null,null,null,null,null,null,null,"PALESTINA",530,41,"HUILA"]
[null,null,null,null,null,null,null,null,null,null,null,null,null,null,null,null,null,null,null,null,null,"PALMAR",522,68,"SANTANDER"]
[null,null,null,null,null,null,null,null,null,null,null,null,null,null,null,null,null,null,null,null,null,"PALMAR DE VARELA",520,8,"ATLANTICO"]
[null,null,null,null,null,null,null,null,null,null,null,null,null,null,null,null,null,null,null,null,null,"PALMAS DEL SOCORRO",524,68,"SANTANDER"]
[null,null,null,null,null,null,null,null,null,null,null,null,null,null,null,null,null,null,null,null,null,"PALMIRA",520,76,"VALLE DEL CAUCA"]
[null,null,null,null,null,null,null,null,null,null,null,null,null,null,null,null,null,null,null,null,null,"PALMITO",523,70,"SUCRE"]
[null,null,null,null,null,null,null,null,null,null,null,null,null,null,null,null,null,null,null,null,null,"PALOCABILDO",520,73,"TOLIMA"]
[null,null,null,null,null,null,null,null,null,null,null,null,null,null,null,null,null,null,null,null,null,"PAMPLONA",518,54,"NORTE DE SANTANDER"]
[null,null,null,null,null,null,null,null,null,null,null,null,null,null,null,null,null,null,null,null,null,"PAMPLONITA",520,54,"NORTE DE SANTANDER"]
[null,null,null,null,null,null,null,null,null,null,null,null,null,null,null,null,null,null,null,null,null,"PANA PANA",887,94,"GUAINIA"]
[null,null,null,null,null,null,null,null,null,null,null,null,null,null,null,null,null,null,null,null,null,"PANDI",524,25,"CUNDINAMARCA"]
[null,null,null,null,null,null,null,null,null,null,null,null,null,null,null,null,null,null,null,null,null,"PANQUEBA",522,15,"BOYACA"]
[null,null,null,null,null,null,null,null,null,null,null,null,null,null,null,null,null,null,null,null,null,"PAPUNAHUA",777,97,"VAUPES"]
[null,null,null,null,null,null,null,null,null,null,null,null,null,null,null,null,null,null,null,null,null,"PARAMO",533,68,"SANTANDER"]
[null,null,null,null,null,null,null,null,null,null,null,null,null,null,null,null,null,null,null,null,null,"PARATEBUENO",530,25,"CUNDINAMARCA"]
[null,null,null,null,null,null,null,null,null,null,null,null,null,null,null,null,null,null,null,null,null,"PASCA",535,25,"CUNDINAMARCA"]
[null,null,null,null,null,null,null,null,null,null,null,null,null,null,null,null,null,null,null,null,null,"PASTO",1,52,"NARIÑO"]
[null,null,null,null,null,null,null,null,null,null,null,null,null,null,null,null,null,null,null,null,null,"PATIA",532,19,"CAUCA"]
[null,null,null,null,null,null,null,null,null,null,null,null,null,null,null,null,null,null,null,null,null,"PAUNA",531,15,"BOYACA"]
[null,null,null,null,null,null,null,null,null,null,null,null,null,null,null,null,null,null,null,null,null,"PAYA",533,15,"BOYACA"]
[null,null,null,null,null,null,null,null,null,null,null,null,null,null,null,null,null,null,null,null,null,"PAZ DE ARIPORO",250,85,"CASANARE"]
[null,null,null,null,null,null,null,null,null,null,null,null,null,null,null,null,null,null,null,null,null,"PAZ DE RIO",537,15,"BOYACA"]
[null,null,null,null,null,null,null,null,null,null,null,null,null,null,null,null,null,null,null,null,null,"PEDRAZA",541,47,"MAGDALENA"]
[null,null,null,null,null,null,null,null,null,null,null,null,null,null,null,null,null,null,null,null,null,"PELAYA",550,20,"CESAR"]
[null,null,null,null,null,null,null,null,null,null,null,null,null,null,null,null,null,null,null,null,null,"PENSILVANIA",541,17,"CALDAS"]
[null,null,null,null,null,null,null,null,null,null,null,null,null,null,null,null,null,null,null,null,null,"PEÑOL",541,5,"ANTIOQUIA"]
[null,null,null,null,null,null,null,null,null,null,null,null,null,null,null,null,null,null,null,null,null,"PEQUE",543,5,"ANTIOQUIA"]
[null,null,null,null,null,null,null,null,null,null,null,null,null,null,null,null,null,null,null,null,null,"PEREIRA",1,66,"RISARALDA"]
[null,null,null,null,null,null,null,null,null,null,null,null,null,null,null,null,null,null,null,null,null,"PESCA",542,15,"BOYACA"]
[null,null,null,null,null,null,null,null,null,null,null,null,null,null,null,null,null,null,null,null,null,"PIAMONTE",533,19,"CAUCA"]
[null,null,null,null,null,null,null,null,null,null,null,null,null,null,null,null,null,null,null,null,null,"PIEDECUESTA",547,68,"SANTANDER"]
[null,null,null,null,null,null,null,null,null,null,null,null,null,null,null,null,null,null,null,null,null,"PIEDRAS",547,73,"TOLIMA"]
[null,null,null,null,null,null,null,null,null,null,null,null,null,null,null,null,null,null,null,null,null,"PIENDAMO",548,19,"CAUCA"]
[null,null,null,null,null,null,null,null,null,null,null,null,null,null,null,null,null,null,null,null,null,"PIJAO",548,63,"QUINDIO"]
[null,null,null,null,null,null,null,null,null,null,null,null,null,null,null,null,null,null,null,null,null,"PIJINO DEL CARMEN",545,47,"MAGDALENA"]
[null,null,null,null,null,null,null,null,null,null,null,null,null,null,null,null,null,null,null,null,null,"PINCHOTE",549,68,"SANTANDER"]
[null,null,null,null,null,null,null,null,null,null,null,null,null,null,null,null,null,null,null,null,null,"PINILLOS",549,13,"BOLIVAR"]
[null,null,null,null,null,null,null,null,null,null,null,null,null,null,null,null,null,null,null,null,null,"PIOJO",549,8,"ATLANTICO"]
[null,null,null,null,null,null,null,null,null,null,null,null,null,null,null,null,null,null,null,null,null,"PISBA",550,15,"BOYACA"]
[null,null,null,null,null,null,null,null,null,null,null,null,null,null,null,null,null,null,null,null,null,"PITAL",548,41,"HUILA"]
[null,null,null,null,null,null,null,null,null,null,null,null,null,null,null,null,null,null,null,null,null,"PITALITO",551,41,"HUILA"]
[null,null,null,null,null,null,null,null,null,null,null,null,null,null,null,null,null,null,null,null,null,"PIVIJAY",551,47,"MAGDALENA"]
[null,null,null,null,null,null,null,null,null,null,null,null,null,null,null,null,null,null,null,null,null,"PLANADAS",555,73,"TOLIMA"]
[null,null,null,null,null,null,null,null,null,null,null,null,null,null,null,null,null,null,null,null,null,"PLANETA RICA",555,23,"CORDOBA"]
[null,null,null,null,null,null,null,null,null,null,null,null,null,null,null,null,null,null,null,null,null,"PLATO",555,47,"MAGDALENA"]
[null,null,null,null,null,null,null,null,null,null,null,null,null,null,null,null,null,null,null,null,null,"POLICARPA",540,52,"NARIÑO"]
[null,null,null,null,null,null,null,null,null,null,null,null,null,null,null,null,null,null,null,null,null,"POLONUEVO",558,8,"ATLANTICO"]
[null,null,null,null,null,null,null,null,null,null,null,null,null,null,null,null,null,null,null,null,null,"PONEDERA",560,8,"ATLANTICO"]
[null,null,null,null,null,null,null,null,null,null,null,null,null,null,null,null,null,null,null,null,null,"POPAYAN",1,19,"CAUCA"]
[null,null,null,null,null,null,null,null,null,null,null,null,null,null,null,null,null,null,null,null,null,"PORE",263,85,"CASANARE"]
[null,null,null,null,null,null,null,null,null,null,null,null,null,null,null,null,null,null,null,null,null,"POTOSI",560,52,"NARIÑO"]
[null,null,null,null,null,null,null,null,null,null,null,null,null,null,null,null,null,null,null,null,null,"PRADERA",563,76,"VALLE DEL CAUCA"]
[null,null,null,null,null,null,null,null,null,null,null,null,null,null,null,null,null,null,null,null,null,"PRADO",563,73,"TOLIMA"]
[null,null,null,null,null,null,null,null,null,null,null,null,null,null,null,null,null,null,null,null,null,"PROVIDENCIA",565,52,"NARIÑO"]
[null,null,null,null,null,null,null,null,null,null,null,null,null,null,null,null,null,null,null,null,null,"PROVIDENCIA Y SANTA CATALINA",564,88,"SAN ANDRES"]
[null,null,null,null,null,null,null,null,null,null,null,null,null,null,null,null,null,null,null,null,null,"PUEBLO BELLO",570,20,"CESAR"]
[null,null,null,null,null,null,null,null,null,null,null,null,null,null,null,null,null,null,null,null,null,"PUEBLO NUEVO",570,23,"CORDOBA"]
[null,null,null,null,null,null,null,null,null,null,null,null,null,null,null,null,null,null,null,null,null,"PUEBLO RICO",572,66,"RISARALDA"]
[null,null,null,null,null,null,null,null,null,null,null,null,null,null,null,null,null,null,null,null,null,"PUEBLORRICO",576,5,"ANTIOQUIA"]
[null,null,null,null,null,null,null,null,null,null,null,null,null,null,null,null,null,null,null,null,null,"PUEBLOVIEJO",570,47,"MAGDALENA"]
[null,null,null,null,null,null,null,null,null,null,null,null,null,null,null,null,null,null,null,null,null,"PUENTE NACIONAL",572,68,"SANTANDER"]
[null,null,null,null,null,null,null,null,null,null,null,null,null,null,null,null,null,null,null,null,null,"PUERRES",573,52,"NARIÑO"]
[null,null,null,null,null,null,null,null,null,null,null,null,null,null,null,null,null,null,null,null,null,"PUERTO ALEGRIA",530,91,"AMAZONAS"]
[null,null,null,null,null,null,null,null,null,null,null,null,null,null,null,null,null,null,null,null,null,"PUERTO ARICA",536,91,"AMAZONAS"]
[null,null,null,null,null,null,null,null,null,null,null,null,null,null,null,null,null,null,null,null,null,"PUERTO ASIS",568,86,"PUTUMAYO"]
[null,null,null,null,null,null,null,null,null,null,null,null,null,null,null,null,null,null,null,null,null,"PUERTO BERRIO",579,5,"ANTIOQUIA"]
[null,null,null,null,null,null,null,null,null,null,null,null,null,null,null,null,null,null,null,null,null,"PUERTO BOYACA",572,15,"BOYACA"]
[null,null,null,null,null,null,null,null,null,null,null,null,null,null,null,null,null,null,null,null,null,"PUERTO CAICEDO",569,86,"PUTUMAYO"]
[null,null,null,null,null,null,null,null,null,null,null,null,null,null,null,null,null,null,null,null,null,"PUERTO CARREÑO",1,99,"VICHADA"]
[null,null,null,null,null,null,null,null,null,null,null,null,null,null,null,null,null,null,null,null,null,"PUERTO COLOMBIA",573,8,"ATLANTICO"]
[null,null,null,null,null,null,null,null,null,null,null,null,null,null,null,null,null,null,null,null,null,"PUERTO COLOMBIA",884,94,"GUAINIA"]
[null,null,null,null,null,null,null,null,null,null,null,null,null,null,null,null,null,null,null,null,null,"PUERTO CONCORDIA",450,50,"META"]
[null,null,null,null,null,null,null,null,null,null,null,null,null,null,null,null,null,null,null,null,null,"PUERTO ESCONDIDO",574,23,"CORDOBA"]
[null,null,null,null,null,null,null,null,null,null,null,null,null,null,null,null,null,null,null,null,null,"PUERTO GAITAN",568,50,"META"]
[null,null,null,null,null,null,null,null,null,null,null,null,null,null,null,null,null,null,null,null,null,"PUERTO GUZMAN",571,86,"PUTUMAYO"]
[null,null,null,null,null,null,null,null,null,null,null,null,null,null,null,null,null,null,null,null,null,"PUERTO LIBERTADOR",580,23,"CORDOBA"]
[null,null,null,null,null,null,null,null,null,null,null,null,null,null,null,null,null,null,null,null,null,"PUERTO LLERAS",577,50,"META"]
[null,null,null,null,null,null,null,null,null,null,null,null,null,null,null,null,null,null,null,null,null,"PUERTO LOPEZ",573,50,"META"]
[null,null,null,null,null,null,null,null,null,null,null,null,null,null,null,null,null,null,null,null,null,"PUERTO NARE",585,5,"ANTIOQUIA"]
[null,null,null,null,null,null,null,null,null,null,null,null,null,null,null,null,null,null,null,null,null,"PUERTO NARIÑO",540,91,"AMAZONAS"]
[null,null,null,null,null,null,null,null,null,null,null,null,null,null,null,null,null,null,null,null,null,"PUERTO PARRA",573,68,"SANTANDER"]
[null,null,null,null,null,null,null,null,null,null,null,null,null,null,null,null,null,null,null,null,null,"PUERTO RICO",592,18,"CAQUETA"]
[null,null,null,null,null,null,null,null,null,null,null,null,null,null,null,null,null,null,null,null,null,"PUERTO RICO",590,50,"META"]
[null,null,null,null,null,null,null,null,null,null,null,null,null,null,null,null,null,null,null,null,null,"PUERTO RONDON",591,81,"ARAUCA"]
[null,null,null,null,null,null,null,null,null,null,null,null,null,null,null,null,null,null,null,null,null,"PUERTO SALGAR",572,25,"CUNDINAMARCA"]
[null,null,null,null,null,null,null,null,null,null,null,null,null,null,null,null,null,null,null,null,null,"PUERTO SANTANDER",553,54,"NORTE DE SANTANDER"]
[null,null,null,null,null,null,null,null,null,null,null,null,null,null,null,null,null,null,null,null,null,"PUERTO SANTANDER",669,91,"AMAZONAS"]
[null,null,null,null,null,null,null,null,null,null,null,null,null,null,null,null,null,null,null,null,null,"PUERTO TEJADA",573,19,"CAUCA"]
[null,null,null,null,null,null,null,null,null,null,null,null,null,null,null,null,null,null,null,null,null,"PUERTO TRIUNFO",591,5,"ANTIOQUIA"]
[null,null,null,null,null,null,null,null,null,null,null,null,null,null,null,null,null,null,null,null,null,"PUERTO WILCHES",575,68,"SANTANDER"]
[null,null,null,null,null,null,null,null,null,null,null,null,null,null,null,null,null,null,null,null,null,"PULI",580,25,"CUNDINAMARCA"]
[null,null,null,null,null,null,null,null,null,null,null,null,null,null,null,null,null,null,null,null,null,"PUPIALES",585,52,"NARIÑO"]
[null,null,null,null,null,null,null,null,null,null,null,null,null,null,null,null,null,null,null,null,null,"PURACE",585,19,"CAUCA"]
[null,null,null,null,null,null,null,null,null,null,null,null,null,null,null,null,null,null,null,null,null,"PURIFICACION",585,73,"TOLIMA"]
[null,null,null,null,null,null,null,null,null,null,null,null,null,null,null,null,null,null,null,null,null,"PURISIMA",586,23,"CORDOBA"]
[null,null,null,null,null,null,null,null,null,null,null,null,null,null,null,null,null,null,null,null,null,"QUEBRADANEGRA",592,25,"CUNDINAMARCA"]
[null,null,null,null,null,null,null,null,null,null,null,null,null,null,null,null,null,null,null,null,null,"QUETAME",594,25,"CUNDINAMARCA"]
[null,null,null,null,null,null,null,null,null,null,null,null,null,null,null,null,null,null,null,null,null,"QUIBDO",1,27,"CHOCO"]
[null,null,null,null,null,null,null,null,null,null,null,null,null,null,null,null,null,null,null,null,null,"QUIMBAYA",594,63,"QUINDIO"]
[null,null,null,null,null,null,null,null,null,null,null,null,null,null,null,null,null,null,null,null,null,"QUINCHIA",594,66,"RISARALDA"]
[null,null,null,null,null,null,null,null,null,null,null,null,null,null,null,null,null,null,null,null,null,"QUIPAMA",580,15,"BOYACA"]
[null,null,null,null,null,null,null,null,null,null,null,null,null,null,null,null,null,null,null,null,null,"QUIPILE",596,25,"CUNDINAMARCA"]
[null,null,null,null,null,null,null,null,null,null,null,null,null,null,null,null,null,null,null,null,null,"RAGONVALIA",599,54,"NORTE DE SANTANDER"]
[null,null,null,null,null,null,null,null,null,null,null,null,null,null,null,null,null,null,null,null,null,"RAMIRIQUI",599,15,"BOYACA"]
[null,null,null,null,null,null,null,null,null,null,null,null,null,null,null,null,null,null,null,null,null,"RAQUIRA",600,15,"BOYACA"]
[null,null,null,null,null,null,null,null,null,null,null,null,null,null,null,null,null,null,null,null,null,"RECETOR",279,85,"CASANARE"]
[null,null,null,null,null,null,null,null,null,null,null,null,null,null,null,null,null,null,null,null,null,"REGIDOR",580,13,"BOLIVAR"]
[null,null,null,null,null,null,null,null,null,null,null,null,null,null,null,null,null,null,null,null,null,"REMEDIOS",604,5,"ANTIOQUIA"]
[null,null,null,null,null,null,null,null,null,null,null,null,null,null,null,null,null,null,null,null,null,"REMOLINO",605,47,"MAGDALENA"]
[null,null,null,null,null,null,null,null,null,null,null,null,null,null,null,null,null,null,null,null,null,"REPELON",606,8,"ATLANTICO"]
[null,null,null,null,null,null,null,null,null,null,null,null,null,null,null,null,null,null,null,null,null,"RESTREPO",606,50,"META"]
[null,null,null,null,null,null,null,null,null,null,null,null,null,null,null,null,null,null,null,null,null,"RESTREPO",606,76,"VALLE DEL CAUCA"]
[null,null,null,null,null,null,null,null,null,null,null,null,null,null,null,null,null,null,null,null,null,"RETIRO",607,5,"ANTIOQUIA"]
[null,null,null,null,null,null,null,null,null,null,null,null,null,null,null,null,null,null,null,null,null,"RICAURTE",612,25,"CUNDINAMARCA"]
[null,null,null,null,null,null,null,null,null,null,null,null,null,null,null,null,null,null,null,null,null,"RICAURTE",612,52,"NARIÑO"]
[null,null,null,null,null,null,null,null,null,null,null,null,null,null,null,null,null,null,null,null,null,"RIO DE ORO",614,20,"CESAR"]
[null,null,null,null,null,null,null,null,null,null,null,null,null,null,null,null,null,null,null,null,null,"RIO IRO",580,27,"CHOCO"]
[null,null,null,null,null,null,null,null,null,null,null,null,null,null,null,null,null,null,null,null,null,"RIO QUITO",600,27,"CHOCO"]
[null,null,null,null,null,null,null,null,null,null,null,null,null,null,null,null,null,null,null,null,null,"RIO VIEJO",600,13,"BOLIVAR"]
[null,null,null,null,null,null,null,null,null,null,null,null,null,null,null,null,null,null,null,null,null,"RIOBLANCO",616,73,"TOLIMA"]
[null,null,null,null,null,null,null,null,null,null,null,null,null,null,null,null,null,null,null,null,null,"RIOFRIO",616,76,"VALLE DEL CAUCA"]
[null,null,null,null,null,null,null,null,null,null,null,null,null,null,null,null,null,null,null,null,null,"RIOHACHA",1,44,"LA GUAJIRA"]
[null,null,null,null,null,null,null,null,null,null,null,null,null,null,null,null,null,null,null,null,null,"RIONEGRO",615,5,"ANTIOQUIA"]
[null,null,null,null,null,null,null,null,null,null,null,null,null,null,null,null,null,null,null,null,null,"RIONEGRO",615,68,"SANTANDER"]
[null,null,null,null,null,null,null,null,null,null,null,null,null,null,null,null,null,null,null,null,null,"RIOSUCIO",614,17,"CALDAS"]
[null,null,null,null,null,null,null,null,null,null,null,null,null,null,null,null,null,null,null,null,null,"RIOSUCIO",615,27,"CHOCO"]
[null,null,null,null,null,null,null,null,null,null,null,null,null,null,null,null,null,null,null,null,null,"RISARALDA",616,17,"CALDAS"]
[null,null,null,null,null,null,null,null,null,null,null,null,null,null,null,null,null,null,null,null,null,"RIVERA",615,41,"HUILA"]
[null,null,null,null,null,null,null,null,null,null,null,null,null,null,null,null,null,null,null,null,null,"ROBERTO PAYAN",621,52,"NARIÑO"]
[null,null,null,null,null,null,null,null,null,null,null,null,null,null,null,null,null,null,null,null,null,"ROLDANILLO",622,76,"VALLE DEL CAUCA"]
[null,null,null,null,null,null,null,null,null,null,null,null,null,null,null,null,null,null,null,null,null,"RONCESVALLES",622,73,"TOLIMA"]
[null,null,null,null,null,null,null,null,null,null,null,null,null,null,null,null,null,null,null,null,null,"RONDON",621,15,"BOYACA"]
[null,null,null,null,null,null,null,null,null,null,null,null,null,null,null,null,null,null,null,null,null,"ROSAS",622,19,"CAUCA"]
[null,null,null,null,null,null,null,null,null,null,null,null,null,null,null,null,null,null,null,null,null,"ROVIRA",624,73,"TOLIMA"]
[null,null,null,null,null,null,null,null,null,null,null,null,null,null,null,null,null,null,null,null,null,"SABANA DE TORRES",655,68,"SANTANDER"]
[null,null,null,null,null,null,null,null,null,null,null,null,null,null,null,null,null,null,null,null,null,"SABANAGRANDE",634,8,"ATLANTICO"]
[null,null,null,null,null,null,null,null,null,null,null,null,null,null,null,null,null,null,null,null,null,"SABANALARGA",628,5,"ANTIOQUIA"]
[null,null,null,null,null,null,null,null,null,null,null,null,null,null,null,null,null,null,null,null,null,"SABANALARGA",638,8,"ATLANTICO"]
[null,null,null,null,null,null,null,null,null,null,null,null,null,null,null,null,null,null,null,null,null,"SABANALARGA",300,85,"CASANARE"]
[null,null,null,null,null,null,null,null,null,null,null,null,null,null,null,null,null,null,null,null,null,"SABANAS DE SAN ANGEL",660,47,"MAGDALENA"]
[null,null,null,null,null,null,null,null,null,null,null,null,null,null,null,null,null,null,null,null,null,"SABANETA",631,5,"ANTIOQUIA"]
[null,null,null,null,null,null,null,null,null,null,null,null,null,null,null,null,null,null,null,null,null,"SABOYA",632,15,"BOYACA"]
[null,null,null,null,null,null,null,null,null,null,null,null,null,null,null,null,null,null,null,null,null,"SACAMA",315,85,"CASANARE"]
[null,null,null,null,null,null,null,null,null,null,null,null,null,null,null,null,null,null,null,null,null,"SACHICA",638,15,"BOYACA"]
[null,null,null,null,null,null,null,null,null,null,null,null,null,null,null,null,null,null,null,null,null,"SAHAGUN",660,23,"CORDOBA"]
[null,null,null,null,null,null,null,null,null,null,null,null,null,null,null,null,null,null,null,null,null,"SALADOBLANCO",660,41,"HUILA"]
[null,null,null,null,null,null,null,null,null,null,null,null,null,null,null,null,null,null,null,null,null,"SALAMINA",653,17,"CALDAS"]
[null,null,null,null,null,null,null,null,null,null,null,null,null,null,null,null,null,null,null,null,null,"SALAMINA",675,47,"MAGDALENA"]
[null,null,null,null,null,null,null,null,null,null,null,null,null,null,null,null,null,null,null,null,null,"SALAZAR",660,54,"NORTE DE SANTANDER"]
[null,null,null,null,null,null,null,null,null,null,null,null,null,null,null,null,null,null,null,null,null,"SALDAÑA",671,73,"TOLIMA"]
[null,null,null,null,null,null,null,null,null,null,null,null,null,null,null,null,null,null,null,null,null,"SALENTO",690,63,"QUINDIO"]
[null,null,null,null,null,null,null,null,null,null,null,null,null,null,null,null,null,null,null,null,null,"SALGAR",642,5,"ANTIOQUIA"]
[null,null,null,null,null,null,null,null,null,null,null,null,null,null,null,null,null,null,null,null,null,"SAMACA",646,15,"BOYACA"]
[null,null,null,null,null,null,null,null,null,null,null,null,null,null,null,null,null,null,null,null,null,"SAMANA",662,17,"CALDAS"]
[null,null,null,null,null,null,null,null,null,null,null,null,null,null,null,null,null,null,null,null,null,"SAMANIEGO",678,52,"NARIÑO"]
[null,null,null,null,null,null,null,null,null,null,null,null,null,null,null,null,null,null,null,null,null,"SAMPUES",670,70,"SUCRE"]
[null,null,null,null,null,null,null,null,null,null,null,null,null,null,null,null,null,null,null,null,null,"SAN AGUSTIN",668,41,"HUILA"]
[null,null,null,null,null,null,null,null,null,null,null,null,null,null,null,null,null,null,null,null,null,"SAN ALBERTO",710,20,"CESAR"]
[null,null,null,null,null,null,null,null,null,null,null,null,null,null,null,null,null,null,null,null,null,"SAN ANDRES",647,5,"ANTIOQUIA"]
[null,null,null,null,null,null,null,null,null,null,null,null,null,null,null,null,null,null,null,null,null,"SAN ANDRES",669,68,"SANTANDER"]
[null,null,null,null,null,null,null,null,null,null,null,null,null,null,null,null,null,null,null,null,null,"SAN ANDRES",1,88,"SAN ANDRES"]
[null,null,null,null,null,null,null,null,null,null,null,null,null,null,null,null,null,null,null,null,null,"SAN ANDRES DE SOTAVENTO",670,23,"CORDOBA"]
[null,null,null,null,null,null,null,null,null,null,null,null,null,null,null,null,null,null,null,null,null,"SAN ANTERO",672,23,"CORDOBA"]
[null,null,null,null,null,null,null,null,null,null,null,null,null,null,null,null,null,null,null,null,null,"SAN ANTONIO",675,73,"TOLIMA"]
[null,null,null,null,null,null,null,null,null,null,null,null,null,null,null,null,null,null,null,null,null,"SAN ANTONIO DE TEQUENDAMA",645,25,"CUNDINAMARCA"]
[null,null,null,null,null,null,null,null,null,null,null,null,null,null,null,null,null,null,null,null,null,"SAN BENITO",673,68,"SANTANDER"]
[null,null,null,null,null,null,null,null,null,null,null,null,null,null,null,null,null,null,null,null,null,"SAN BENITO ABAD",678,70,"SUCRE"]
[null,null,null,null,null,null,null,null,null,null,null,null,null,null,null,null,null,null,null,null,null,"SAN BERNARDO",649,25,"CUNDINAMARCA"]
[null,null,null,null,null,null,null,null,null,null,null,null,null,null,null,null,null,null,null,null,null,"SAN BERNARDO",685,52,"NARIÑO"]
[null,null,null,null,null,null,null,null,null,null,null,null,null,null,null,null,null,null,null,null,null,"SAN BERNARDO DEL VIENTO",675,23,"CORDOBA"]
[null,null,null,null,null,null,null,null,null,null,null,null,null,null,null,null,null,null,null,null,null,"SAN CALIXTO",670,54,"NORTE DE SANTANDER"]
[null,null,null,null,null,null,null,null,null,null,null,null,null,null,null,null,null,null,null,null,null,"SAN CARLOS",649,5,"ANTIOQUIA"]
[null,null,null,null,null,null,null,null,null,null,null,null,null,null,null,null,null,null,null,null,null,"SAN CARLOS",678,23,"CORDOBA"]
[null,null,null,null,null,null,null,null,null,null,null,null,null,null,null,null,null,null,null,null,null,"SAN CARLOS GUAROA",680,50,"META"]
[null,null,null,null,null,null,null,null,null,null,null,null,null,null,null,null,null,null,null,null,null,"SAN CAYETANO",653,25,"CUNDINAMARCA"]
[null,null,null,null,null,null,null,null,null,null,null,null,null,null,null,null,null,null,null,null,null,"SAN CAYETANO",673,54,"NORTE DE SANTANDER"]
[null,null,null,null,null,null,null,null,null,null,null,null,null,null,null,null,null,null,null,null,null,"SAN CRISTOBAL",620,13,"BOLIVAR"]
[null,null,null,null,null,null,null,null,null,null,null,null,null,null,null,null,null,null,null,null,null,"SAN DIEGO",750,20,"CESAR"]
[null,null,null,null,null,null,null,null,null,null,null,null,null,null,null,null,null,null,null,null,null,"SAN EDUARDO",660,15,"BOYACA"]
[null,null,null,null,null,null,null,null,null,null,null,null,null,null,null,null,null,null,null,null,null,"SAN ESTANISLAO",647,13,"BOLIVAR"]
[null,null,null,null,null,null,null,null,null,null,null,null,null,null,null,null,null,null,null,null,null,"SAN FELIPE",883,94,"GUAINIA"]
[null,null,null,null,null,null,null,null,null,null,null,null,null,null,null,null,null,null,null,null,null,"SAN FERNANDO",650,13,"BOLIVAR"]
[null,null,null,null,null,null,null,null,null,null,null,null,null,null,null,null,null,null,null,null,null,"SAN FRANCISCO",652,5,"ANTIOQUIA"]
[null,null,null,null,null,null,null,null,null,null,null,null,null,null,null,null,null,null,null,null,null,"SAN FRANCISCO",658,25,"CUNDINAMARCA"]
[null,null,null,null,null,null,null,null,null,null,null,null,null,null,null,null,null,null,null,null,null,"SAN FRANCISCO",755,86,"PUTUMAYO"]
[null,null,null,null,null,null,null,null,null,null,null,null,null,null,null,null,null,null,null,null,null,"SAN GIL",679,68,"SANTANDER"]
[null,null,null,null,null,null,null,null,null,null,null,null,null,null,null,null,null,null,null,null,null,"SAN JACINTO",654,13,"BOLIVAR"]
[null,null,null,null,null,null,null,null,null,null,null,null,null,null,null,null,null,null,null,null,null,"SAN JACINTO DEL CAUCA",655,13,"BOLIVAR"]
[null,null,null,null,null,null,null,null,null,null,null,null,null,null,null,null,null,null,null,null,null,"SAN JERONIMO",656,5,"ANTIOQUIA"]
[null,null,null,null,null,null,null,null,null,null,null,null,null,null,null,null,null,null,null,null,null,"SAN JOAQUIN",682,68,"SANTANDER"]
[null,null,null,null,null,null,null,null,null,null,null,null,null,null,null,null,null,null,null,null,null,"SAN JOSE",665,17,"CALDAS"]
[null,null,null,null,null,null,null,null,null,null,null,null,null,null,null,null,null,null,null,null,null,"SAN JOSE DE LA FRAGUA",610,18,"CAQUETA"]
[null,null,null,null,null,null,null,null,null,null,null,null,null,null,null,null,null,null,null,null,null,"SAN JOSE DE LA MONTAÑA",658,5,"ANTIOQUIA"]
[null,null,null,null,null,null,null,null,null,null,null,null,null,null,null,null,null,null,null,null,null,"SAN JOSE DE MIRANDA",684,68,"SANTANDER"]
[null,null,null,null,null,null,null,null,null,null,null,null,null,null,null,null,null,null,null,null,null,"SAN JOSE DE PARE",664,15,"BOYACA"]
[null,null,null,null,null,null,null,null,null,null,null,null,null,null,null,null,null,null,null,null,null,"SAN JOSE DEL GUAVIARE",1,95,"GUAVIARE"]
[null,null,null,null,null,null,null,null,null,null,null,null,null,null,null,null,null,null,null,null,null,"SAN JOSE DEL PALMAR",660,27,"CHOCO"]
[null,null,null,null,null,null,null,null,null,null,null,null,null,null,null,null,null,null,null,null,null,"SAN JUAN BETULIA",702,70,"SUCRE"]
[null,null,null,null,null,null,null,null,null,null,null,null,null,null,null,null,null,null,null,null,null,"SAN JUAN DE ARAMA",683,50,"META"]
[null,null,null,null,null,null,null,null,null,null,null,null,null,null,null,null,null,null,null,null,null,"SAN JUAN DE RIOSECO",662,25,"CUNDINAMARCA"]
[null,null,null,null,null,null,null,null,null,null,null,null,null,null,null,null,null,null,null,null,null,"SAN JUAN DE URABA",659,5,"ANTIOQUIA"]
[null,null,null,null,null,null,null,null,null,null,null,null,null,null,null,null,null,null,null,null,null,"SAN JUAN DEL CESAR",650,44,"LA GUAJIRA"]
[null,null,null,null,null,null,null,null,null,null,null,null,null,null,null,null,null,null,null,null,null,"SAN JUAN NEPOMUCENO",657,13,"BOLIVAR"]
[null,null,null,null,null,null,null,null,null,null,null,null,null,null,null,null,null,null,null,null,null,"SAN JUANITO",686,50,"META"]
[null,null,null,null,null,null,null,null,null,null,null,null,null,null,null,null,null,null,null,null,null,"SAN LORENZO",687,52,"NARIÑO"]
[null,null,null,null,null,null,null,null,null,null,null,null,null,null,null,null,null,null,null,null,null,"SAN LUIS",660,5,"ANTIOQUIA"]
[null,null,null,null,null,null,null,null,null,null,null,null,null,null,null,null,null,null,null,null,null,"SAN LUIS",678,73,"TOLIMA"]
[null,null,null,null,null,null,null,null,null,null,null,null,null,null,null,null,null,null,null,null,null,"SAN LUIS DE CUBARRAL",223,50,"META"]
[null,null,null,null,null,null,null,null,null,null,null,null,null,null,null,null,null,null,null,null,null,"SAN LUIS DE GACENO",667,15,"BOYACA"]
[null,null,null,null,null,null,null,null,null,null,null,null,null,null,null,null,null,null,null,null,null,"SAN LUIS DE PALENQUE",325,85,"CASANARE"]
[null,null,null,null,null,null,null,null,null,null,null,null,null,null,null,null,null,null,null,null,null,"SAN MARCOS",708,70,"SUCRE"]
[null,null,null,null,null,null,null,null,null,null,null,null,null,null,null,null,null,null,null,null,null,"SAN MARTIN",770,20,"CESAR"]
[null,null,null,null,null,null,null,null,null,null,null,null,null,null,null,null,null,null,null,null,null,"SAN MARTIN",689,50,"META"]
[null,null,null,null,null,null,null,null,null,null,null,null,null,null,null,null,null,null,null,null,null,"SAN MARTIN DE LOBA",667,13,"BOLIVAR"]
[null,null,null,null,null,null,null,null,null,null,null,null,null,null,null,null,null,null,null,null,null,"SAN MATEO",673,15,"BOYACA"]
[null,null,null,null,null,null,null,null,null,null,null,null,null,null,null,null,null,null,null,null,null,"SAN MIGUEL",686,68,"SANTANDER"]
[null,null,null,null,null,null,null,null,null,null,null,null,null,null,null,null,null,null,null,null,null,"SAN MIGUEL",757,86,"PUTUMAYO"]
[null,null,null,null,null,null,null,null,null,null,null,null,null,null,null,null,null,null,null,null,null,"SAN MIGUEL DE SEMA",676,15,"BOYACA"]
[null,null,null,null,null,null,null,null,null,null,null,null,null,null,null,null,null,null,null,null,null,"SAN ONOFRE",713,70,"SUCRE"]
[null,null,null,null,null,null,null,null,null,null,null,null,null,null,null,null,null,null,null,null,null,"SAN PABLO",670,13,"BOLIVAR"]
[null,null,null,null,null,null,null,null,null,null,null,null,null,null,null,null,null,null,null,null,null,"SAN PABLO",693,52,"NARIÑO"]
[null,null,null,null,null,null,null,null,null,null,null,null,null,null,null,null,null,null,null,null,null,"SAN PABLO BORBUR",681,15,"BOYACA"]
[null,null,null,null,null,null,null,null,null,null,null,null,null,null,null,null,null,null,null,null,null,"SAN PEDRO",664,5,"ANTIOQUIA"]
[null,null,null,null,null,null,null,null,null,null,null,null,null,null,null,null,null,null,null,null,null,"SAN PEDRO",717,70,"SUCRE"]
[null,null,null,null,null,null,null,null,null,null,null,null,null,null,null,null,null,null,null,null,null,"SAN PEDRO",670,76,"VALLE DEL CAUCA"]
[null,null,null,null,null,null,null,null,null,null,null,null,null,null,null,null,null,null,null,null,null,"SAN PEDRO DE CARTAGO",694,52,"NARIÑO"]
[null,null,null,null,null,null,null,null,null,null,null,null,null,null,null,null,null,null,null,null,null,"SAN PEDRO DE URABA",665,5,"ANTIOQUIA"]
[null,null,null,null,null,null,null,null,null,null,null,null,null,null,null,null,null,null,null,null,null,"SAN PELAYO",686,23,"CORDOBA"]
[null,null,null,null,null,null,null,null,null,null,null,null,null,null,null,null,null,null,null,null,null,"SAN RAFAEL",667,5,"ANTIOQUIA"]
[null,null,null,null,null,null,null,null,null,null,null,null,null,null,null,null,null,null,null,null,null,"SAN ROQUE",670,5,"ANTIOQUIA"]
[null,null,null,null,null,null,null,null,null,null,null,null,null,null,null,null,null,null,null,null,null,"SAN ROSA VITERBO",693,15,"BOYACA"]
[null,null,null,null,null,null,null,null,null,null,null,null,null,null,null,null,null,null,null,null,null,"SAN SEBASTIAN",693,19,"CAUCA"]
[null,null,null,null,null,null,null,null,null,null,null,null,null,null,null,null,null,null,null,null,null,"SAN SEBASTIAN DE BUENAVISTA",692,47,"MAGDALENA"]
[null,null,null,null,null,null,null,null,null,null,null,null,null,null,null,null,null,null,null,null,null,"SAN VICENTE",674,5,"ANTIOQUIA"]
[null,null,null,null,null,null,null,null,null,null,null,null,null,null,null,null,null,null,null,null,null,"SAN VICENTE DE CHUCURI",689,68,"SANTANDER"]
[null,null,null,null,null,null,null,null,null,null,null,null,null,null,null,null,null,null,null,null,null,"SAN VICENTE DEL CAGÜAN",753,18,"CAQUETA"]
[null,null,null,null,null,null,null,null,null,null,null,null,null,null,null,null,null,null,null,null,null,"SAN ZENON",703,47,"MAGDALENA"]
[null,null,null,null,null,null,null,null,null,null,null,null,null,null,null,null,null,null,null,null,null,"SANDONA",683,52,"NARIÑO"]
[null,null,null,null,null,null,null,null,null,null,null,null,null,null,null,null,null,null,null,null,null,"SANTA ANA",707,47,"MAGDALENA"]
[null,null,null,null,null,null,null,null,null,null,null,null,null,null,null,null,null,null,null,null,null,"SANTA BARBARA",679,5,"ANTIOQUIA"]
[null,null,null,null,null,null,null,null,null,null,null,null,null,null,null,null,null,null,null,null,null,"SANTA BARBARA",696,52,"NARIÑO"]
[null,null,null,null,null,null,null,null,null,null,null,null,null,null,null,null,null,null,null,null,null,"SANTA BARBARA",705,68,"SANTANDER"]
[null,null,null,null,null,null,null,null,null,null,null,null,null,null,null,null,null,null,null,null,null,"SANTA BARBARA DE PINTO",720,47,"MAGDALENA"]
[null,null,null,null,null,null,null,null,null,null,null,null,null,null,null,null,null,null,null,null,null,"SANTA CATALINA",673,13,"BOLIVAR"]
[null,null,null,null,null,null,null,null,null,null,null,null,null,null,null,null,null,null,null,null,null,"SANTA HELENA DEL OPON",720,68,"SANTANDER"]
[null,null,null,null,null,null,null,null,null,null,null,null,null,null,null,null,null,null,null,null,null,"SANTA ISABEL",686,73,"TOLIMA"]
[null,null,null,null,null,null,null,null,null,null,null,null,null,null,null,null,null,null,null,null,null,"SANTA LUCIA",675,8,"ATLANTICO"]
[null,null,null,null,null,null,null,null,null,null,null,null,null,null,null,null,null,null,null,null,null,"SANTA MARIA",690,15,"BOYACA"]
[null,null,null,null,null,null,null,null,null,null,null,null,null,null,null,null,null,null,null,null,null,"SANTA MARIA",676,41,"HUILA"]
[null,null,null,null,null,null,null,null,null,null,null,null,null,null,null,null,null,null,null,null,null,"SANTA MARTA",1,47,"MAGDALENA"]
[null,null,null,null,null,null,null,null,null,null,null,null,null,null,null,null,null,null,null,null,null,"SANTA ROSA",683,13,"BOLIVAR"]
[null,null,null,null,null,null,null,null,null,null,null,null,null,null,null,null,null,null,null,null,null,"SANTA ROSA",701,19,"CAUCA"]
[null,null,null,null,null,null,null,null,null,null,null,null,null,null,null,null,null,null,null,null,null,"SANTA ROSA DE CABAL",682,66,"RISARALDA"]
[null,null,null,null,null,null,null,null,null,null,null,null,null,null,null,null,null,null,null,null,null,"SANTA ROSA DE OSOS",686,5,"ANTIOQUIA"]
[null,null,null,null,null,null,null,null,null,null,null,null,null,null,null,null,null,null,null,null,null,"SANTA ROSA DEL SUR",688,13,"BOLIVAR"]
[null,null,null,null,null,null,null,null,null,null,null,null,null,null,null,null,null,null,null,null,null,"SANTA ROSALIA",624,99,"VICHADA"]
[null,null,null,null,null,null,null,null,null,null,null,null,null,null,null,null,null,null,null,null,null,"SANTA SOFIA",696,15,"BOYACA"]
[null,null,null,null,null,null,null,null,null,null,null,null,null,null,null,null,null,null,null,null,null,"SANTACRUZ",699,52,"NARIÑO"]
[null,null,null,null,null,null,null,null,null,null,null,null,null,null,null,null,null,null,null,null,null,"SANTAFE DE ANTIOQUIA",42,5,"ANTIOQUIA"]
[null,null,null,null,null,null,null,null,null,null,null,null,null,null,null,null,null,null,null,null,null,"SANTANA",686,15,"BOYACA"]
[null,null,null,null,null,null,null,null,null,null,null,null,null,null,null,null,null,null,null,null,null,"SANTANDER DE QUILICHAO",698,19,"CAUCA"]
[null,null,null,null,null,null,null,null,null,null,null,null,null,null,null,null,null,null,null,null,null,"SANTIAGO",680,54,"NORTE DE SANTANDER"]
[null,null,null,null,null,null,null,null,null,null,null,null,null,null,null,null,null,null,null,null,null,"SANTIAGO",760,86,"PUTUMAYO"]
[null,null,null,null,null,null,null,null,null,null,null,null,null,null,null,null,null,null,null,null,null,"SANTIAGO DE TOLÚ",820,70,"SUCRE"]
[null,null,null,null,null,null,null,null,null,null,null,null,null,null,null,null,null,null,null,null,null,"SANTO DOMINGO",690,5,"ANTIOQUIA"]
[null,null,null,null,null,null,null,null,null,null,null,null,null,null,null,null,null,null,null,null,null,"SANTO TOMAS",685,8,"ATLANTICO"]
[null,null,null,null,null,null,null,null,null,null,null,null,null,null,null,null,null,null,null,null,null,"SANTUARIO",697,5,"ANTIOQUIA"]
[null,null,null,null,null,null,null,null,null,null,null,null,null,null,null,null,null,null,null,null,null,"SANTUARIO",687,66,"RISARALDA"]
[null,null,null,null,null,null,null,null,null,null,null,null,null,null,null,null,null,null,null,null,null,"SAPUYES",720,52,"NARIÑO"]
[null,null,null,null,null,null,null,null,null,null,null,null,null,null,null,null,null,null,null,null,null,"SARAVENA",736,81,"ARAUCA"]
[null,null,null,null,null,null,null,null,null,null,null,null,null,null,null,null,null,null,null,null,null,"SARDINATA",720,54,"NORTE DE SANTANDER"]
[null,null,null,null,null,null,null,null,null,null,null,null,null,null,null,null,null,null,null,null,null,"SASAIMA",718,25,"CUNDINAMARCA"]
[null,null,null,null,null,null,null,null,null,null,null,null,null,null,null,null,null,null,null,null,null,"SATIVANORTE",720,15,"BOYACA"]
[null,null,null,null,null,null,null,null,null,null,null,null,null,null,null,null,null,null,null,null,null,"SATIVASUR",723,15,"BOYACA"]
[null,null,null,null,null,null,null,null,null,null,null,null,null,null,null,null,null,null,null,null,null,"SEGOVIA",736,5,"ANTIOQUIA"]
[null,null,null,null,null,null,null,null,null,null,null,null,null,null,null,null,null,null,null,null,null,"SESQUILE",736,25,"CUNDINAMARCA"]
[null,null,null,null,null,null,null,null,null,null,null,null,null,null,null,null,null,null,null,null,null,"SEVILLA",736,76,"VALLE DEL CAUCA"]
[null,null,null,null,null,null,null,null,null,null,null,null,null,null,null,null,null,null,null,null,null,"SIACHOQUE",740,15,"BOYACA"]
[null,null,null,null,null,null,null,null,null,null,null,null,null,null,null,null,null,null,null,null,null,"SIBATE",740,25,"CUNDINAMARCA"]
[null,null,null,null,null,null,null,null,null,null,null,null,null,null,null,null,null,null,null,null,null,"SIBUNDOY",749,86,"PUTUMAYO"]
[null,null,null,null,null,null,null,null,null,null,null,null,null,null,null,null,null,null,null,null,null,"SILOS",743,54,"NORTE DE SANTANDER"]
[null,null,null,null,null,null,null,null,null,null,null,null,null,null,null,null,null,null,null,null,null,"SILVANIA",743,25,"CUNDINAMARCA"]
[null,null,null,null,null,null,null,null,null,null,null,null,null,null,null,null,null,null,null,null,null,"SILVIA",743,19,"CAUCA"]
[null,null,null,null,null,null,null,null,null,null,null,null,null,null,null,null,null,null,null,null,null,"SIMACOTA",745,68,"SANTANDER"]
[null,null,null,null,null,null,null,null,null,null,null,null,null,null,null,null,null,null,null,null,null,"SIMIJACA",745,25,"CUNDINAMARCA"]
[null,null,null,null,null,null,null,null,null,null,null,null,null,null,null,null,null,null,null,null,null,"SIMITI",744,13,"BOLIVAR"]
[null,null,null,null,null,null,null,null,null,null,null,null,null,null,null,null,null,null,null,null,null,"SINCE",742,70,"SUCRE"]
[null,null,null,null,null,null,null,null,null,null,null,null,null,null,null,null,null,null,null,null,null,"SINCELEJO",1,70,"SUCRE"]
[null,null,null,null,null,null,null,null,null,null,null,null,null,null,null,null,null,null,null,null,null,"SIPI",745,27,"CHOCO"]
[null,null,null,null,null,null,null,null,null,null,null,null,null,null,null,null,null,null,null,null,null,"SITIONUEVO",745,47,"MAGDALENA"]
[null,null,null,null,null,null,null,null,null,null,null,null,null,null,null,null,null,null,null,null,null,"SOACHA",754,25,"CUNDINAMARCA"]
[null,null,null,null,null,null,null,null,null,null,null,null,null,null,null,null,null,null,null,null,null,"SOATA",753,15,"BOYACA"]
[null,null,null,null,null,null,null,null,null,null,null,null,null,null,null,null,null,null,null,null,null,"SOCHA",757,15,"BOYACA"]
[null,null,null,null,null,null,null,null,null,null,null,null,null,null,null,null,null,null,null,null,null,"SOCORRO",755,68,"SANTANDER"]
[null,null,null,null,null,null,null,null,null,null,null,null,null,null,null,null,null,null,null,null,null,"SOCOTA",755,15,"BOYACA"]
[null,null,null,null,null,null,null,null,null,null,null,null,null,null,null,null,null,null,null,null,null,"SOGAMOSO",759,15,"BOYACA"]
[null,null,null,null,null,null,null,null,null,null,null,null,null,null,null,null,null,null,null,null,null,"SOLANO",756,18,"CAQUETA"]
[null,null,null,null,null,null,null,null,null,null,null,null,null,null,null,null,null,null,null,null,null,"SOLEDAD",758,8,"ATLANTICO"]
[null,null,null,null,null,null,null,null,null,null,null,null,null,null,null,null,null,null,null,null,null,"SOLITA",785,18,"CAQUETA"]
[null,null,null,null,null,null,null,null,null,null,null,null,null,null,null,null,null,null,null,null,null,"SOMONDOCO",761,15,"BOYACA"]
[null,null,null,null,null,null,null,null,null,null,null,null,null,null,null,null,null,null,null,null,null,"SONSON",756,5,"ANTIOQUIA"]
[null,null,null,null,null,null,null,null,null,null,null,null,null,null,null,null,null,null,null,null,null,"SOPETRAN",761,5,"ANTIOQUIA"]
[null,null,null,null,null,null,null,null,null,null,null,null,null,null,null,null,null,null,null,null,null,"SOPLAVIENTO",760,13,"BOLIVAR"]
[null,null,null,null,null,null,null,null,null,null,null,null,null,null,null,null,null,null,null,null,null,"SOPO",758,25,"CUNDINAMARCA"]
[null,null,null,null,null,null,null,null,null,null,null,null,null,null,null,null,null,null,null,null,null,"SORA",762,15,"BOYACA"]
[null,null,null,null,null,null,null,null,null,null,null,null,null,null,null,null,null,null,null,null,null,"SORACA",764,15,"BOYACA"]
[null,null,null,null,null,null,null,null,null,null,null,null,null,null,null,null,null,null,null,null,null,"SOTAQUIRA",763,15,"BOYACA"]
[null,null,null,null,null,null,null,null,null,null,null,null,null,null,null,null,null,null,null,null,null,"SOTARA",760,19,"CAUCA"]
[null,null,null,null,null,null,null,null,null,null,null,null,null,null,null,null,null,null,null,null,null,"SUAITA",770,68,"SANTANDER"]
[null,null,null,null,null,null,null,null,null,null,null,null,null,null,null,null,null,null,null,null,null,"SUAN",770,8,"ATLANTICO"]
[null,null,null,null,null,null,null,null,null,null,null,null,null,null,null,null,null,null,null,null,null,"SUAREZ",780,19,"CAUCA"]
[null,null,null,null,null,null,null,null,null,null,null,null,null,null,null,null,null,null,null,null,null,"SUAREZ",770,73,"TOLIMA"]
[null,null,null,null,null,null,null,null,null,null,null,null,null,null,null,null,null,null,null,null,null,"SUAZA",770,41,"HUILA"]
[null,null,null,null,null,null,null,null,null,null,null,null,null,null,null,null,null,null,null,null,null,"SUBACHOQUE",769,25,"CUNDINAMARCA"]
[null,null,null,null,null,null,null,null,null,null,null,null,null,null,null,null,null,null,null,null,null,"SUCRE",785,19,"CAUCA"]
[null,null,null,null,null,null,null,null,null,null,null,null,null,null,null,null,null,null,null,null,null,"SUCRE",773,68,"SANTANDER"]
[null,null,null,null,null,null,null,null,null,null,null,null,null,null,null,null,null,null,null,null,null,"SUCRE",771,70,"SUCRE"]
[null,null,null,null,null,null,null,null,null,null,null,null,null,null,null,null,null,null,null,null,null,"SUESCA",772,25,"CUNDINAMARCA"]
[null,null,null,null,null,null,null,null,null,null,null,null,null,null,null,null,null,null,null,null,null,"SUPATA",777,25,"CUNDINAMARCA"]
[null,null,null,null,null,null,null,null,null,null,null,null,null,null,null,null,null,null,null,null,null,"SUPIA",777,17,"CALDAS"]
[null,null,null,null,null,null,null,null,null,null,null,null,null,null,null,null,null,null,null,null,null,"SURATA",780,68,"SANTANDER"]
[null,null,null,null,null,null,null,null,null,null,null,null,null,null,null,null,null,null,null,null,null,"SUSA",779,25,"CUNDINAMARCA"]
[null,null,null,null,null,null,null,null,null,null,null,null,null,null,null,null,null,null,null,null,null,"SUSACON",774,15,"BOYACA"]
[null,null,null,null,null,null,null,null,null,null,null,null,null,null,null,null,null,null,null,null,null,"SUTAMARCHAN",776,15,"BOYACA"]
[null,null,null,null,null,null,null,null,null,null,null,null,null,null,null,null,null,null,null,null,null,"SUTATAUSA",781,25,"CUNDINAMARCA"]
[null,null,null,null,null,null,null,null,null,null,null,null,null,null,null,null,null,null,null,null,null,"SUTATENZA",778,15,"BOYACA"]
[null,null,null,null,null,null,null,null,null,null,null,null,null,null,null,null,null,null,null,null,null,"TABIO",785,25,"CUNDINAMARCA"]
[null,null,null,null,null,null,null,null,null,null,null,null,null,null,null,null,null,null,null,null,null,"TADO",787,27,"CHOCO"]
[null,null,null,null,null,null,null,null,null,null,null,null,null,null,null,null,null,null,null,null,null,"TALAIGUA NUEVO",780,13,"BOLIVAR"]
[null,null,null,null,null,null,null,null,null,null,null,null,null,null,null,null,null,null,null,null,null,"TAMALAMEQUE",787,20,"CESAR"]
[null,null,null,null,null,null,null,null,null,null,null,null,null,null,null,null,null,null,null,null,null,"TAMARA",400,85,"CASANARE"]
[null,null,null,null,null,null,null,null,null,null,null,null,null,null,null,null,null,null,null,null,null,"TAME",794,81,"ARAUCA"]
[null,null,null,null,null,null,null,null,null,null,null,null,null,null,null,null,null,null,null,null,null,"TAMESIS",789,5,"ANTIOQUIA"]
[null,null,null,null,null,null,null,null,null,null,null,null,null,null,null,null,null,null,null,null,null,"TAMINANGO",786,52,"NARIÑO"]
[null,null,null,null,null,null,null,null,null,null,null,null,null,null,null,null,null,null,null,null,null,"TANGUA",788,52,"NARIÑO"]
[null,null,null,null,null,null,null,null,null,null,null,null,null,null,null,null,null,null,null,null,null,"TARAIRA",666,97,"VAUPES"]
[null,null,null,null,null,null,null,null,null,null,null,null,null,null,null,null,null,null,null,null,null,"TARAPACA",798,91,"AMAZONAS"]
[null,null,null,null,null,null,null,null,null,null,null,null,null,null,null,null,null,null,null,null,null,"TARAZA",790,5,"ANTIOQUIA"]
[null,null,null,null,null,null,null,null,null,null,null,null,null,null,null,null,null,null,null,null,null,"TARQUI",791,41,"HUILA"]
[null,null,null,null,null,null,null,null,null,null,null,null,null,null,null,null,null,null,null,null,null,"TARSO",792,5,"ANTIOQUIA"]
[null,null,null,null,null,null,null,null,null,null,null,null,null,null,null,null,null,null,null,null,null,"TASCO",790,15,"BOYACA"]
[null,null,null,null,null,null,null,null,null,null,null,null,null,null,null,null,null,null,null,null,null,"TAURAMENA",410,85,"CASANARE"]
[null,null,null,null,null,null,null,null,null,null,null,null,null,null,null,null,null,null,null,null,null,"TAUSA",793,25,"CUNDINAMARCA"]
[null,null,null,null,null,null,null,null,null,null,null,null,null,null,null,null,null,null,null,null,null,"TELLO",799,41,"HUILA"]
[null,null,null,null,null,null,null,null,null,null,null,null,null,null,null,null,null,null,null,null,null,"TENA",797,25,"CUNDINAMARCA"]
[null,null,null,null,null,null,null,null,null,null,null,null,null,null,null,null,null,null,null,null,null,"TENERIFE",798,47,"MAGDALENA"]
[null,null,null,null,null,null,null,null,null,null,null,null,null,null,null,null,null,null,null,null,null,"TENJO",799,25,"CUNDINAMARCA"]
[null,null,null,null,null,null,null,null,null,null,null,null,null,null,null,null,null,null,null,null,null,"TENZA",798,15,"BOYACA"]
[null,null,null,null,null,null,null,null,null,null,null,null,null,null,null,null,null,null,null,null,null,"TEORAMA",800,54,"NORTE DE SANTANDER"]
[null,null,null,null,null,null,null,null,null,null,null,null,null,null,null,null,null,null,null,null,null,"TERUEL",801,41,"HUILA"]
[null,null,null,null,null,null,null,null,null,null,null,null,null,null,null,null,null,null,null,null,null,"TESALIA",797,41,"HUILA"]
[null,null,null,null,null,null,null,null,null,null,null,null,null,null,null,null,null,null,null,null,null,"TIBACUY",805,25,"CUNDINAMARCA"]
[null,null,null,null,null,null,null,null,null,null,null,null,null,null,null,null,null,null,null,null,null,"TIBANA",804,15,"BOYACA"]
[null,null,null,null,null,null,null,null,null,null,null,null,null,null,null,null,null,null,null,null,null,"TIBASOSA",806,15,"BOYACA"]
[null,null,null,null,null,null,null,null,null,null,null,null,null,null,null,null,null,null,null,null,null,"TIBIRITA",807,25,"CUNDINAMARCA"]
[null,null,null,null,null,null,null,null,null,null,null,null,null,null,null,null,null,null,null,null,null,"TIBU",810,54,"NORTE DE SANTANDER"]
[null,null,null,null,null,null,null,null,null,null,null,null,null,null,null,null,null,null,null,null,null,"TIERRALTA",807,23,"CORDOBA"]
[null,null,null,null,null,null,null,null,null,null,null,null,null,null,null,null,null,null,null,null,null,"TIMANA",807,41,"HUILA"]
[null,null,null,null,null,null,null,null,null,null,null,null,null,null,null,null,null,null,null,null,null,"TIMBIO",807,19,"CAUCA"]
[null,null,null,null,null,null,null,null,null,null,null,null,null,null,null,null,null,null,null,null,null,"TIMBIQUI",809,19,"CAUCA"]
[null,null,null,null,null,null,null,null,null,null,null,null,null,null,null,null,null,null,null,null,null,"TINJACA",808,15,"BOYACA"]
[null,null,null,null,null,null,null,null,null,null,null,null,null,null,null,null,null,null,null,null,null,"TIPACOQUE",810,15,"BOYACA"]
[null,null,null,null,null,null,null,null,null,null,null,null,null,null,null,null,null,null,null,null,null,"TIQUISIO",810,13,"BOLIVAR"]
[null,null,null,null,null,null,null,null,null,null,null,null,null,null,null,null,null,null,null,null,null,"TITIRIBI",809,5,"ANTIOQUIA"]
[null,null,null,null,null,null,null,null,null,null,null,null,null,null,null,null,null,null,null,null,null,"TOCA",814,15,"BOYACA"]
[null,null,null,null,null,null,null,null,null,null,null,null,null,null,null,null,null,null,null,null,null,"TOCAIMA",815,25,"CUNDINAMARCA"]
[null,null,null,null,null,null,null,null,null,null,null,null,null,null,null,null,null,null,null,null,null,"TOCANCIPA",817,25,"CUNDINAMARCA"]
[null,null,null,null,null,null,null,null,null,null,null,null,null,null,null,null,null,null,null,null,null,"TOGUI",816,15,"BOYACA"]
[null,null,null,null,null,null,null,null,null,null,null,null,null,null,null,null,null,null,null,null,null,"TOLEDO",819,5,"ANTIOQUIA"]
[null,null,null,null,null,null,null,null,null,null,null,null,null,null,null,null,null,null,null,null,null,"TOLEDO",820,54,"NORTE DE SANTANDER"]
[null,null,null,null,null,null,null,null,null,null,null,null,null,null,null,null,null,null,null,null,null,"TOLÚ VIEJO",823,70,"SUCRE"]
[null,null,null,null,null,null,null,null,null,null,null,null,null,null,null,null,null,null,null,null,null,"TONA",820,68,"SANTANDER"]
[null,null,null,null,null,null,null,null,null,null,null,null,null,null,null,null,null,null,null,null,null,"TOPAGA",820,15,"BOYACA"]
[null,null,null,null,null,null,null,null,null,null,null,null,null,null,null,null,null,null,null,null,null,"TOPAIPI",823,25,"CUNDINAMARCA"]
[null,null,null,null,null,null,null,null,null,null,null,null,null,null,null,null,null,null,null,null,null,"TORIBIO",821,19,"CAUCA"]
[null,null,null,null,null,null,null,null,null,null,null,null,null,null,null,null,null,null,null,null,null,"TORO",823,76,"VALLE DEL CAUCA"]
[null,null,null,null,null,null,null,null,null,null,null,null,null,null,null,null,null,null,null,null,null,"TOTA",822,15,"BOYACA"]
[null,null,null,null,null,null,null,null,null,null,null,null,null,null,null,null,null,null,null,null,null,"TOTORO",824,19,"CAUCA"]
[null,null,null,null,null,null,null,null,null,null,null,null,null,null,null,null,null,null,null,null,null,"TRINIDAD",430,85,"CASANARE"]
[null,null,null,null,null,null,null,null,null,null,null,null,null,null,null,null,null,null,null,null,null,"TRUJILLO",828,76,"VALLE DEL CAUCA"]
[null,null,null,null,null,null,null,null,null,null,null,null,null,null,null,null,null,null,null,null,null,"TUBARA",832,8,"ATLANTICO"]
[null,null,null,null,null,null,null,null,null,null,null,null,null,null,null,null,null,null,null,null,null,"TULUA",834,76,"VALLE DEL CAUCA"]
[null,null,null,null,null,null,null,null,null,null,null,null,null,null,null,null,null,null,null,null,null,"TUMACO",835,52,"NARIÑO"]
[null,null,null,null,null,null,null,null,null,null,null,null,null,null,null,null,null,null,null,null,null,"TUNJA",1,15,"BOYACA"]
[null,null,null,null,null,null,null,null,null,null,null,null,null,null,null,null,null,null,null,null,null,"TUNUNGUA",832,15,"BOYACA"]
[null,null,null,null,null,null,null,null,null,null,null,null,null,null,null,null,null,null,null,null,null,"TUQUERRES",838,52,"NARIÑO"]
[null,null,null,null,null,null,null,null,null,null,null,null,null,null,null,null,null,null,null,null,null,"TURBACO",836,13,"BOLIVAR"]
[null,null,null,null,null,null,null,null,null,null,null,null,null,null,null,null,null,null,null,null,null,"TURBANA",838,13,"BOLIVAR"]
[null,null,null,null,null,null,null,null,null,null,null,null,null,null,null,null,null,null,null,null,null,"TURBO",837,5,"ANTIOQUIA"]
[null,null,null,null,null,null,null,null,null,null,null,null,null,null,null,null,null,null,null,null,null,"TURMEQUE",835,15,"BOYACA"]
[null,null,null,null,null,null,null,null,null,null,null,null,null,null,null,null,null,null,null,null,null,"TUTA",837,15,"BOYACA"]
[null,null,null,null,null,null,null,null,null,null,null,null,null,null,null,null,null,null,null,null,null,"TUTAZA",839,15,"BOYACA"]
[null,null,null,null,null,null,null,null,null,null,null,null,null,null,null,null,null,null,null,null,null,"UBALA",839,25,"CUNDINAMARCA"]
[null,null,null,null,null,null,null,null,null,null,null,null,null,null,null,null,null,null,null,null,null,"UBAQUE",841,25,"CUNDINAMARCA"]
[null,null,null,null,null,null,null,null,null,null,null,null,null,null,null,null,null,null,null,null,null,"UBATE",843,25,"CUNDINAMARCA"]
[null,null,null,null,null,null,null,null,null,null,null,null,null,null,null,null,null,null,null,null,null,"ULLOA",845,76,"VALLE DEL CAUCA"]
[null,null,null,null,null,null,null,null,null,null,null,null,null,null,null,null,null,null,null,null,null,"UMBITA",842,15,"BOYACA"]
[null,null,null,null,null,null,null,null,null,null,null,null,null,null,null,null,null,null,null,null,null,"UNE",845,25,"CUNDINAMARCA"]
[null,null,null,null,null,null,null,null,null,null,null,null,null,null,null,null,null,null,null,null,null,"UNGUIA",800,27,"CHOCO"]
[null,null,null,null,null,null,null,null,null,null,null,null,null,null,null,null,null,null,null,null,null,"UNION PANAMERICANA",810,27,"CHOCO"]
[null,null,null,null,null,null,null,null,null,null,null,null,null,null,null,null,null,null,null,null,null,"URAMITA",842,5,"ANTIOQUIA"]
[null,null,null,null,null,null,null,null,null,null,null,null,null,null,null,null,null,null,null,null,null,"URIBIA",847,44,"LA GUAJIRA"]
[null,null,null,null,null,null,null,null,null,null,null,null,null,null,null,null,null,null,null,null,null,"URRAO",847,5,"ANTIOQUIA"]
[null,null,null,null,null,null,null,null,null,null,null,null,null,null,null,null,null,null,null,null,null,"URUMITA",855,44,"LA GUAJIRA"]
[null,null,null,null,null,null,null,null,null,null,null,null,null,null,null,null,null,null,null,null,null,"USIACURI",849,8,"ATLANTICO"]
[null,null,null,null,null,null,null,null,null,null,null,null,null,null,null,null,null,null,null,null,null,"UTICA",851,25,"CUNDINAMARCA"]
[null,null,null,null,null,null,null,null,null,null,null,null,null,null,null,null,null,null,null,null,null,"VALDIVIA",854,5,"ANTIOQUIA"]
[null,null,null,null,null,null,null,null,null,null,null,null,null,null,null,null,null,null,null,null,null,"VALENCIA",855,23,"CORDOBA"]
[null,null,null,null,null,null,null,null,null,null,null,null,null,null,null,null,null,null,null,null,null,"VALLE DE SAN JUAN",854,73,"TOLIMA"]
[null,null,null,null,null,null,null,null,null,null,null,null,null,null,null,null,null,null,null,null,null,"VALLE DEL GUAMUEZ",865,86,"PUTUMAYO"]
[null,null,null,null,null,null,null,null,null,null,null,null,null,null,null,null,null,null,null,null,null,"VALLE SAN JOSE",855,68,"SANTANDER"]
[null,null,null,null,null,null,null,null,null,null,null,null,null,null,null,null,null,null,null,null,null,"VALLEDUPAR",1,20,"CESAR"]
[null,null,null,null,null,null,null,null,null,null,null,null,null,null,null,null,null,null,null,null,null,"VALPARAISO",856,5,"ANTIOQUIA"]
[null,null,null,null,null,null,null,null,null,null,null,null,null,null,null,null,null,null,null,null,null,"VALPARAISO",860,18,"CAQUETA"]
[null,null,null,null,null,null,null,null,null,null,null,null,null,null,null,null,null,null,null,null,null,"VEGACHI",858,5,"ANTIOQUIA"]
[null,null,null,null,null,null,null,null,null,null,null,null,null,null,null,null,null,null,null,null,null,"VELEZ",861,68,"SANTANDER"]
[null,null,null,null,null,null,null,null,null,null,null,null,null,null,null,null,null,null,null,null,null,"VENADILLO",861,73,"TOLIMA"]
[null,null,null,null,null,null,null,null,null,null,null,null,null,null,null,null,null,null,null,null,null,"VENECIA",861,5,"ANTIOQUIA"]
[null,null,null,null,null,null,null,null,null,null,null,null,null,null,null,null,null,null,null,null,null,"VENECIA",506,25,"CUNDINAMARCA"]
[null,null,null,null,null,null,null,null,null,null,null,null,null,null,null,null,null,null,null,null,null,"VENTAQUEMADA",861,15,"BOYACA"]
[null,null,null,null,null,null,null,null,null,null,null,null,null,null,null,null,null,null,null,null,null,"VERGARA",862,25,"CUNDINAMARCA"]
[null,null,null,null,null,null,null,null,null,null,null,null,null,null,null,null,null,null,null,null,null,"VERSALLES",863,76,"VALLE DEL CAUCA"]
[null,null,null,null,null,null,null,null,null,null,null,null,null,null,null,null,null,null,null,null,null,"VETAS",867,68,"SANTANDER"]
[null,null,null,null,null,null,null,null,null,null,null,null,null,null,null,null,null,null,null,null,null,"VIANI",867,25,"CUNDINAMARCA"]
[null,null,null,null,null,null,null,null,null,null,null,null,null,null,null,null,null,null,null,null,null,"VICTORIA",867,17,"CALDAS"]
[null,null,null,null,null,null,null,null,null,null,null,null,null,null,null,null,null,null,null,null,null,"VIGIA DEL FUERTE",873,5,"ANTIOQUIA"]
[null,null,null,null,null,null,null,null,null,null,null,null,null,null,null,null,null,null,null,null,null,"VIJES",869,76,"VALLE DEL CAUCA"]
[null,null,null,null,null,null,null,null,null,null,null,null,null,null,null,null,null,null,null,null,null,"VILLA CARO",871,54,"NORTE DE SANTANDER"]
[null,null,null,null,null,null,null,null,null,null,null,null,null,null,null,null,null,null,null,null,null,"VILLA DE LEYVA",407,15,"BOYACA"]
[null,null,null,null,null,null,null,null,null,null,null,null,null,null,null,null,null,null,null,null,null,"VILLA DEL ROSARIO",874,54,"NORTE DE SANTANDER"]
[null,null,null,null,null,null,null,null,null,null,null,null,null,null,null,null,null,null,null,null,null,"VILLA RICA",845,19,"CAUCA"]
[null,null,null,null,null,null,null,null,null,null,null,null,null,null,null,null,null,null,null,null,null,"VILLAGARZON",885,86,"PUTUMAYO"]
[null,null,null,null,null,null,null,null,null,null,null,null,null,null,null,null,null,null,null,null,null,"VILLAGOMEZ",871,25,"CUNDINAMARCA"]
[null,null,null,null,null,null,null,null,null,null,null,null,null,null,null,null,null,null,null,null,null,"VILLAHERMOSA",870,73,"TOLIMA"]
[null,null,null,null,null,null,null,null,null,null,null,null,null,null,null,null,null,null,null,null,null,"VILLAMARIA",873,17,"CALDAS"]
[null,null,null,null,null,null,null,null,null,null,null,null,null,null,null,null,null,null,null,null,null,"VILLANUEVA",873,13,"BOLIVAR"]
[null,null,null,null,null,null,null,null,null,null,null,null,null,null,null,null,null,null,null,null,null,"VILLANUEVA",874,44,"LA GUAJIRA"]
[null,null,null,null,null,null,null,null,null,null,null,null,null,null,null,null,null,null,null,null,null,"VILLANUEVA",872,68,"SANTANDER"]
[null,null,null,null,null,null,null,null,null,null,null,null,null,null,null,null,null,null,null,null,null,"VILLANUEVA",440,85,"CASANARE"]
[null,null,null,null,null,null,null,null,null,null,null,null,null,null,null,null,null,null,null,null,null,"VILLAPINZON",873,25,"CUNDINAMARCA"]
[null,null,null,null,null,null,null,null,null,null,null,null,null,null,null,null,null,null,null,null,null,"VILLARRICA",873,73,"TOLIMA"]
[null,null,null,null,null,null,null,null,null,null,null,null,null,null,null,null,null,null,null,null,null,"VILLAVICENCIO",1,50,"META"]
[null,null,null,null,null,null,null,null,null,null,null,null,null,null,null,null,null,null,null,null,null,"VILLAVIEJA",872,41,"HUILA"]
[null,null,null,null,null,null,null,null,null,null,null,null,null,null,null,null,null,null,null,null,null,"VILLETA",875,25,"CUNDINAMARCA"]
[null,null,null,null,null,null,null,null,null,null,null,null,null,null,null,null,null,null,null,null,null,"VIOTA",878,25,"CUNDINAMARCA"]
[null,null,null,null,null,null,null,null,null,null,null,null,null,null,null,null,null,null,null,null,null,"VIRACACHA",879,15,"BOYACA"]
[null,null,null,null,null,null,null,null,null,null,null,null,null,null,null,null,null,null,null,null,null,"VISTA HERMOSA",711,50,"META"]
[null,null,null,null,null,null,null,null,null,null,null,null,null,null,null,null,null,null,null,null,null,"VITERBO",877,17,"CALDAS"]
[null,null,null,null,null,null,null,null,null,null,null,null,null,null,null,null,null,null,null,null,null,"YACOPI",885,25,"CUNDINAMARCA"]
[null,null,null,null,null,null,null,null,null,null,null,null,null,null,null,null,null,null,null,null,null,"YACUANQUER",885,52,"NARIÑO"]
[null,null,null,null,null,null,null,null,null,null,null,null,null,null,null,null,null,null,null,null,null,"YAGUARA",885,41,"HUILA"]
[null,null,null,null,null,null,null,null,null,null,null,null,null,null,null,null,null,null,null,null,null,"YALI",885,5,"ANTIOQUIA"]
[null,null,null,null,null,null,null,null,null,null,null,null,null,null,null,null,null,null,null,null,null,"YARUMAL",887,5,"ANTIOQUIA"]
[null,null,null,null,null,null,null,null,null,null,null,null,null,null,null,null,null,null,null,null,null,"YAVARATE",889,97,"VAUPES"]
[null,null,null,null,null,null,null,null,null,null,null,null,null,null,null,null,null,null,null,null,null,"YOLOMBO",890,5,"ANTIOQUIA"]
[null,null,null,null,null,null,null,null,null,null,null,null,null,null,null,null,null,null,null,null,null,"YONDO",893,5,"ANTIOQUIA"]
[null,null,null,null,null,null,null,null,null,null,null,null,null,null,null,null,null,null,null,null,null,"YOPAL",1,85,"CASANARE"]
[null,null,null,null,null,null,null,null,null,null,null,null,null,null,null,null,null,null,null,null,null,"YOTOCO",890,76,"VALLE DEL CAUCA"]
[null,null,null,null,null,null,null,null,null,null,null,null,null,null,null,null,null,null,null,null,null,"YUMBO",892,76,"VALLE DEL CAUCA"]
[null,null,null,null,null,null,null,null,null,null,null,null,null,null,null,null,null,null,null,null,null,"ZAMBRANO",894,13,"BOLIVAR"]
[null,null,null,null,null,null,null,null,null,null,null,null,null,null,null,null,null,null,null,null,null,"ZAPATOCA",895,68,"SANTANDER"]
[null,null,null,null,null,null,null,null,null,null,null,null,null,null,null,null,null,null,null,null,null,"ZAPAYAN",960,47,"MAGDALENA"]
[null,null,null,null,null,null,null,null,null,null,null,null,null,null,null,null,null,null,null,null,null,"ZARAGOZA",895,5,"ANTIOQUIA"]
[null,null,null,null,null,null,null,null,null,null,null,null,null,null,null,null,null,null,null,null,null,"ZARZAL",895,76,"VALLE DEL CAUCA"]
[null,null,null,null,null,null,null,null,null,null,null,null,null,null,null,null,null,null,null,null,null,"ZETAQUIRA",897,15,"BOYACA"]
[null,null,null,null,null,null,null,null,null,null,null,null,null,null,null,null,null,null,null,null,null,"ZIPACON",898,25,"CUNDINAMARCA"]
[null,null,null,null,null,null,null,null,null,null,null,null,null,null,null,null,null,null,null,null,null,"ZIPAQUIRA",899,25,"CUNDINAMARCA"]
[null,null,null,null,null,null,null,null,null,null,null,null,null,null,null,null,null,null,null,null,null,"ZONA BANANERA",980,47,"MAGDALENA"]

{"sheet":"Instructivo","index":3,"n_rows":55,"n_cols":3,"rows_kept":55,"cut":false,"hidden":false,"merged":[[54,1,54,8],[14,2,14,8],[13,2,13,8],[15,2,15,8],[51,2,51,8],[43,2,43,8],[44,2,44,8],[46,2,46,8],[47,2,50,8],[42,2,42,8],[31,2,31,8],[32,2,32,8],[33,2,33,8],[34,2,34,8],[35,2,35,8],[36,2,37,8],[38,2,38,8],[39,2,39,8],[40,2,40,8],[41,2,41,8],[30,2,30,8],[28,2,28,8],[19,2,19,8],[20,2,20,8],[21,2,21,8],[22,2,22,8],[23,2,23,8],[29,2,29,8],[18,2,18,8],[3,1,3,8],[5,1,5,8],[7,1,7,8],[8,2,8,8],[9,2,9,8],[10,2,10,8],[11,2,11,8],[12,2,12,8],[16,2,16,8],[17,1,17,8],[24,2,24,8],[25,2,25,8],[26,2,26,8],[27,2,27,8]]}
[]
[]
[]
[null,"INSTRUCTIVO DE DILIGENCIAMIENTO\nREGISTRO UNICO DE BENEFICIARIOS FINALES - RUB - RESOLUCIÓN 164 DE 2021 DIAN"]
[]
[null,"A continuación, se describe cada uno de los campos del formato habilitados para su correcto diligenciamiento:"]
[]
[null,"Datos Básicos del Producto"]
[null,"Campo","Descripción"]
[null,"Tipo de producto de posee con la entidad   ","Seleccionar de la lista desplegable el producto que posee con la entidad"]
[null,"Fecha","Año, mes y día en el que se diligencia el formato."]
[null,"NIESPJ","Código asignado por la DIAN - Este campo será diligenciado únicamente por la Entidad"]
[null,"Nombre del Producto","Indicar el Nombre del producto.    Ejemplo: Nombre del Patrimonio Autónomo."]
[null,"Nombre del Responsable de Diligenciamiento   ","Nombre de la persona que cuenta con la autorización o está facultada para otorgar la información"]
[null,"Número de identificación","Diligenciar sin guiones, puntos, comas, espacios en blanco.  "]
[null,"Actuando en Calidad de","Seleccionar de la lista desplegable la calidad, si selecciona la opción Otro en la siguiente casilla debe complementar la información."]
[null,"Cuál","Describir la calidad"]
[null,"Datos de los Beneficiarios Finales"]
[null,"Campo","Descripción"]
[null,"Nombre de la empresa o razón social","Nombre o razón social de la persona jurídica que está vinculada directamente con nuestra entidad."]
[null,"NIT","Nit de la empresa"]
[null,"Dígito de Verificación","Dígito de Verificación - DV - diligenciar en caso de que aplique"]
[null,"Porcentaje de Participación de la Persona Natural o Jurídica en la ESPJ","Campo para ser diligenciado únicamente para personas jurídicas, si es persona natural por favor diligenciar N/A.\nEl valor puede estar entre 0 y 100.  No diligencie signo de porcentaje.\nCorresponde al porcentaje de participación que posee la persona jurídica dentro el producto de nuestra entidad."]
[null,"Tipo de documento","En esta casilla se debe seleccionar entre las opciones: \nRegistro civil de nacimiento, Tarjeta de identidad, Cédula de ciudadanía, Tarjeta de extranjería, Cédula de extranjería, Pasaporte, Tipo documento extranjero, Permiso Especial de Permanencia. "]
[null,"Número de identificación","En caso de que el beneficiario final no tenga número de identificación expedido en la República de Colombia, se debe reportar el número de identificación que tenga en otro país. Diligenciar sin guiones, puntos, comas, espacios en blanco.  "]
[null,"País de expedición ","País de expedición del documento de identificación."]
[null,"Número de Identificación Tributaria","En caso de que el beneficiario final no tenga número de identificación tributaria en la República de Colombia, se debe reportar el número de identificación tributaria que tenga en otro país.  Diligenciar sin guiones, puntos, comas, espacios en blanco.  En caso de que el beneficiario final no tenga Número de Identificación Tributaria, debe reportar el mismonúmero de identificación."]
[null,"País de expedición del número de identificación tributaria","País de expedición del Número de Identificación Tributaria.  En caso de que el beneficiario final no tenga Número de Identificación Tributaria, debe reportar el país de expedición del número de identificación."]
[null,"Primer apellido ","Primer apellido del beneficiario final."]
[null,"Segundo apellido   ","Segundo apellido del beneficiario final."]
[null,"Primer nombre   ","Primer nombre del beneficiario final."]
[null,"Otros nombres  ","Otros nombres del beneficiario final."]
[null,"Fecha de nacimiento   ","Fecha de nacimiento del beneficiario final."]
[null,"País de nacimiento ","País de nacimiento del beneficiario final."]
[null,"País de nacionalidad  ","País de nacionalidad del beneficiario final."]
[null,"País de residencia  ","País o países de residencia del beneficiario final."]
[null,"Departamento de Dirección de Notificación","Diligenciar únicamente cuando la dirección de notificación sea en la República de Colombia. "]
[null,"Municipio de Dirección de Notificación"]
[null,"Dirección de Notificación  ","Indicar la totalidad de la dirección física."]
[null,"Código postal","Código postal de la dirección de notificación."]
[null,"Correo Electrónico ","Correo electrónico del beneficiario final."]
[null,"Porcentaje de participación en el capital de la persona jurídica","El valor puede estar entre 0 y 100.  No diligencie signo de porcentaje."]
[null,"Fecha inicial desde la cual tiene la calidad de beneficiario final o existe la condición","En esta casilla se debe indicar la fecha desde la cual la persona natural tiene la calidad de beneficiario final o existe la condición. Siempre se debe diligenciar. "]
[null,"Fecha final desde la cual deja de tener la calidad de beneficiario final o existe la condición","En esta casilla se debe indicar la fecha desde la cual la persona natural dejó tener la calidad de beneficiario final o de existir la condición.  "]
[null,"Tipo de novedad","En esta casilla se debe seleccionar entre las opciones: \nReporte inicial, Actualización o Terminación"]
[]
[null,"Campo","Descripción"]
[null,"Beneficiario final de la estructura sin personería jurídica - Fiduciante / Fideicomitente  / Constituyente o posición similar o equivalente ","En estas casillas se debe seleccionar Si o No. Estos campos siempre se deben diligenciar. \n\n\nUnicamente se debe marcar una de las 4 opciones en Si, las Demas dejar en No."]
[null,"Beneficiario final de la estructura sin personería jurídica - Fiduciario o posición similar o equivalente "]
[null,"Beneficiario final de la estructura sin personería jurídica - Comité financiero o posición similar o equivalente "]
[null,"Beneficiario final de la estructura sin personería jurídica - Ejerce el control final y/o efectivo o tiene derecho a gozar y/o disponer de los activos, beneficios, resultados o utilidades "]
[null,"Condiciones que se debe(n) cumplir para tener la calidad de beneficiario final (Beneficiario Condicionado)","En esta casilla se deben indicar las condiciones que se deben cumplir para tener la calidad de beneficiario final, según aplique."]
[]
[]
[null,"Nota: Una vez diligenciada la totalidad de la información, debe guardar el documento excel en su equipo y luego dar clic en el botón Generar PDF para imprimirlo y tomar las firmas."]

{"sheet":"Formato","index":4,"n_rows":117,"n_cols":32,"rows_kept":117,"cut":false,"hidden":false,"merged":[[5,0,5,10],[4,0,4,10],[15,2,15,10],[11,0,11,1],[11,2,11,6],[13,0,13,1],[13,7,13,8],[13,2,13,4],[7,0,7,12],[9,0,9,1],[9,2,9,4],[9,7,9,8],[13,11,13,13]]}
[]
[]
[]
[]
["REGISTRO ÚNICO DE BENEFICIARIOS FINALES - RUB"]
["RESOLUCIÓN 164 DE 2021 DIAN"]
[]
["Dando cumplimiento a la Resolución 164 del 27 de diciembre del 2021 expedida por la Dirección de Impuestos y Aduanas Nacionales (DIAN), mediante la cual se crea el Registro Único de Beneficiarios Finales (RUB), por favor diligencie los siguientes campos, con el fin de efectuar el reporte electrónico correspondiente a través de los sistemas informáticos de dicha entidad:"]
[]
["Tipo de producto de posee con la entidad   ",null,null,null,null,"NIESPJ",null,"Fecha Diligenciamiento   ",null,"DD/MM/AAAA"]
[]
["Nombre del Producto    "]
[]
["Nombre del Responsable de Diligenciamiento",null,null,null,null,"Número de identificación",null,"Actuando en Calidad de",null,null,"Cuál  "]
[]
[null,null,"Si la información a reportar es de un beneficiario directo Persona Natural, No se requiere diligenciar la información de la columna A a la C:\nTenga en cuenta que, ante cualquier modificación de la información aquí suministrada, debe efectuar su respectiva actualización mediante el diligenciamiento de un nuevo formato.",null,null,null,null,null,null,null,null,null,null,null,null,null,null,null,null,null,null,null,null,null,null,null,null,null,null,null,null,{"$f":"+MAX(AF18:AF118)","v":0}]
["Nombre de la Empresa o Razón Social","NIT","DV","% de Participación de la Persona Jurídica o Natural en la ESPJ","Tipo de documento","Número de identificación","País de expedición del número de identificación","Número de identificación tributaria","País de expedición del número de identificación tributaria","Primer apellido","Segundo apellido","Primer nombre","Otros nombres","Fecha de nacimiento (DD/MM/AAAA)","País de nacimiento","País de nacionalidad","País de residencia","Departamento de dirección de notificación","Municipio de dirección de notificación","Dirección de notificación","Código postal de dirección de notificación","Correo Electrónico","Fecha inicial desde la cual tiene la calidad de beneficiario final o existe la condición (DD/MM/AAAA)","Fecha final desde la cual deja de tener la calidad de beneficiario final o existe la condición (DD/MM/AAAA)","Tipo de novedad","Porcentaje de participación en el capital de la persona jurídica","Beneficiario final de la estructura sin personería jurídica - fiduciante / Fideicomitente / constituyente o posición similar o equivalente","Beneficiario final de la estructura sin personería jurídica - Comité fiduciario / comité financiero o posición similar o equivalente","Beneficiario final de la estructura sin personería jurídica - Fideicomisario / Beneficiario","Beneficiario final de la estructura sin personería jurídica - Ejerce el control final y/o efectivo o tiene derecho a gozar y/o disponer de los activos, resultados o utilidades","Condiciones que se deben cumplir para tener la calidad de beneficiario final",0]
[null,null,null,null,null,null,null,null,null,null,null,null,null,null,null,null,null,null,null,null,null,null,null,null,null,null,null,null,null,null,null,{"$f":"+IF(F18<>\"\",+AF17+1,IF(AE18<>\"\",AF17+1,\"\"))","v":""}]
[null,null,null,null,null,null,null,null,null,null,null,null,null,null,null,null,null,null,null,null,null,null,null,null,null,null,null,null,null,null,null,{"$f":"+IF(F19<>\"\",+AF18+1,IF(AE19<>\"\",AF18+1,\"\"))","v":""}]
[null,null,null,null,null,null,null,null,null,null,null,null,null,null,null,null,null,null,null,null,null,null,null,null,null,null,null,null,null,null,null,""]
[null,null,null,null,null,null,null,null,null,null,null,null,null,null,null,null,null,null,null,null,null,null,null,null,null,null,null,null,null,null,null,""]
[null,null,null,null,null,null,null,null,null,null,null,null,null,null,null,null,null,null,null,null,null,null,null,null,null,null,null,null,null,null,null,""]
[null,null,null,null,null,null,null,null,null,null,null,null,null,null,null,null,null,null,null,null,null,null,null,null,null,null,null,null,null,null,null,""]
[null,null,null,null,null,null,null,null,null,null,null,null,null,null,null,null,null,null,null,null,null,null,null,null,null,null,null,null,null,null,null,""]
[null,null,null,null,null,null,null,null,null,null,null,null,null,null,null,null,null,null,null,null,null,null,null,null,null,null,null,null,null,null,null,""]
[null,null,null,null,null,null,null,null,null,null,null,null,null,null,null,null,null,null,null,null,null,null,null,null,null,null,null,null,null,null,null,""]
[null,null,null,null,null,null,null,null,null,null,null,null,null,null,null,null,null,null,null,null,null,null,null,null,null,null,null,null,null,null,null,""]
[null,null,null,null,null,null,null,null,null,null,null,null,null,null,null,null,null,null,null,null,null,null,null,null,null,null,null,null,null,null,null,""]
[null,null,null,null,null,null,null,null,null,null,null,null,null,null,null,null,null,null,null,null,null,null,null,null,null,null,null,null,null,null,null,""]
[null,null,null,null,null,null,null,null,null,null,null,null,null,null,null,null,null,null,null,null,null,null,null,null,null,null,null,null,null,null,null,""]
[null,null,null,null,null,null,null,null,null,null,null,null,null,null,null,null,null,null,null,null,null,null,null,null,null,null,null,null,null,null,null,""]
[null,null,null,null,null,null,null,null,null,null,null,null,null,null,null,null,null,null,null,null,null,null,null,null,null,null,null,null,null,null,null,""]
[null,null,null,null,null,null,null,null,null,null,null,null,null,null,null,null,null,null,null,null,null,null,null,null,null,null,null,null,null,null,null,""]
[null,null,null,null,null,null,null,null,null,null,null,null,null,null,null,null,null,null,null,null,null,null,null,null,null,null,null,null,null,null,null,""]
[null,null,null,null,null,null,null,null,null,null,null,null,null,null,null,null,null,null,null,null,null,null,null,null,null,null,null,null,null,null,null,""]
[null,null,null,null,null,null,null,null,null,null,null,null,null,null,null,null,null,null,null,null,null,null,null,null,null,null,null,null,null,null,null,""]
[null,null,null,null,null,null,null,null,null,null,null,null,null,null,null,null,null,null,null,null,null,null,null,null,null,null,null,null,null,null,null,""]
[null,null,null,null,null,null,null,null,null,null,null,null,null,null,null,null,null,null,null,null,null,null,null,null,null,null,null,null,null,null,null,""]
[null,null,null,null,null,null,null,null,null,null,null,null,null,null,null,null,null,null,null,null,null,null,null,null,null,null,null,null,null,null,null,""]
[null,null,null,null,null,null,null,null,null,null,null,null,null,null,null,null,null,null,null,null,null,null,null,null,null,null,null,null,null,null,null,""]
[null,null,null,null,null,null,null,null,null,null,null,null,null,null,null,null,null,null,null,null,null,null,null,null,null,null,null,null,null,null,null,""]
[null,null,null,null,null,null,null,null,null,null,null,null,null,null,null,null,null,null,null,null,null,null,null,null,null,null,null,null,null,null,null,""]
[null,null,null,null,null,null,null,null,null,null,null,null,null,null,null,null,null,null,null,null,null,null,null,null,null,null,null,null,null,null,null,""]
[null,null,null,null,null,null,null,null,null,null,null,null,null,null,null,null,null,null,null,null,null,null,null,null,null,null,null,null,null,null,null,""]
[null,null,null,null,null,null,null,null,null,null,null,null,null,null,null,null,null,null,null,null,null,null,null,null,null,null,null,null,null,null,null,""]
[null,null,null,null,null,null,null,null,null,null,null,null,null,null,null,null,null,null,null,null,null,null,null,null,null,null,null,null,null,null,null,""]
[null,null,null,null,null,null,null,null,null,null,null,null,null,null,null,null,null,null,null,null,null,null,null,null,null,null,null,null,null,null,null,""]
[null,null,null,null,null,null,null,null,null,null,null,null,null,null,null,null,null,null,null,null,null,null,null,null,null,null,null,null,null,null,null,""]
[null,null,null,null,null,null,null,null,null,null,null,null,null,null,null,null,null,null,null,null,null,null,null,null,null,null,null,null,null,null,null,""]
[null,null,null,null,null,null,null,null,null,null,null,null,null,null,null,null,null,null,null,null,null,null,null,null,null,null,null,null,null,null,null,""]
[null,null,null,null,null,null,null,null,null,null,null,null,null,null,null,null,null,null,null,null,null,null,null,null,null,null,null,null,null,null,null,""]
[null,null,null,null,null,null,null,null,null,null,null,null,null,null,null,null,null,null,null,null,null,null,null,null,null,null,null,null,null,null,null,""]
[null,null,null,null,null,null,null,null,null,null,null,null,null,null,null,null,null,null,null,null,null,null,null,null,null,null,null,null,null,null,null,""]
[null,null,null,null,null,null,null,null,null,null,null,null,null,null,null,null,null,null,null,null,null,null,null,null,null,null,null,null,null,null,null,""]
[null,null,null,null,null,null,null,null,null,null,null,null,null,null,null,null,null,null,null,null,null,null,null,null,null,null,null,null,null,null,null,""]
[null,null,null,null,null,null,null,null,null,null,null,null,null,null,null,null,null,null,null,null,null,null,null,null,null,null,null,null,null,null,null,""]
[null,null,null,null,null,null,null,null,null,null,null,null,null,null,null,null,null,null,null,null,null,null,null,null,null,null,null,null,null,null,null,""]
[null,null,null,null,null,null,null,null,null,null,null,null,null,null,null,null,null,null,null,null,null,null,null,null,null,null,null,null,null,null,null,""]
[null,null,null,null,null,null,null,null,null,null,null,null,null,null,null,null,null,null,null,null,null,null,null,null,null,null,null,null,null,null,null,""]
[null,null,null,null,null,null,null,null,null,null,null,null,null,null,null,null,null,null,null,null,null,null,null,null,null,null,null,null,null,null,null,""]
[null,null,null,null,null,null,null,null,null,null,null,null,null,null,null,null,null,null,null,null,null,null,null,null,null,null,null,null,null,null,null,""]
[null,null,null,null,null,null,null,null,null,null,null,null,null,null,null,null,null,null,null,null,null,null,null,null,null,null,null,null,null,null,null,""]
[null,null,null,null,null,null,null,null,null,null,null,null,null,null,null,null,null,null,null,null,null,null,null,null,null,null,null,null,null,null,null,""]
[null,null,null,null,null,null,null,null,null,null,null,null,null,null,null,null,null,null,null,null,null,null,null,null,null,null,null,null,null,null,null,""]
[null,null,null,null,null,null,null,null,null,null,null,null,null,null,null,null,null,null,null,null,null,null,null,null,null,null,null,null,null,null,null,""]
[null,null,null,null,null,null,null,null,null,null,null,null,null,null,null,null,null,null,null,null,null,null,null,null,null,null,null,null,null,null,null,""]
[null,null,null,null,null,null,null,null,null,null,null,null,null,null,null,null,null,null,null,null,null,null,null,null,null,null,null,null,null,null,null,""]
[null,null,null,null,null,null,null,null,null,null,null,null,null,null,null,null,null,null,null,null,null,null,null,null,null,null,null,null,null,null,null,""]
[null,null,null,null,null,null,null,null,null,null,null,null,null,null,null,null,null,null,null,null,null,null,null,null,null,null,null,null,null,null,null,""]
[null,null,null,null,null,null,null,null,null,null,null,null,null,null,null,null,null,null,null,null,null,null,null,null,null,null,null,null,null,null,null,""]
[null,null,null,null,null,null,null,null,null,null,null,null,null,null,null,null,null,null,null,null,null,null,null,null,null,null,null,null,null,null,null,""]
[null,null,null,null,null,null,null,null,null,null,null,null,null,null,null,null,null,null,null,null,null,null,null,null,null,null,null,null,null,null,null,""]
[null,null,null,null,null,null,null,null,null,null,null,null,null,null,null,null,null,null,null,null,null,null,null,null,null,null,null,null,null,null,null,""]
[null,null,null,null,null,null,null,null,null,null,null,null,null,null,null,null,null,null,null,null,null,null,null,null,null,null,null,null,null,null,null,""]
[null,null,null,null,null,null,null,null,null,null,null,null,null,null,null,null,null,null,null,null,null,null,null,null,null,null,null,null,null,null,null,""]
[null,null,null,null,null,null,null,null,null,null,null,null,null,null,null,null,null,null,null,null,null,null,null,null,null,null,null,null,null,null,null,""]
[null,null,null,null,null,null,null,null,null,null,null,null,null,null,null,null,null,null,null,null,null,null,null,null,null,null,null,null,null,null,null,""]
[null,null,null,null,null,null,null,null,null,null,null,null,null,null,null,null,null,null,null,null,null,null,null,null,null,null,null,null,null,null,null,""]
[null,null,null,null,null,null,null,null,null,null,null,null,null,null,null,null,null,null,null,null,null,null,null,null,null,null,null,null,null,null,null,""]
[null,null,null,null,null,null,null,null,null,null,null,null,null,null,null,null,null,null,null,null,null,null,null,null,null,null,null,null,null,null,null,""]
[null,null,null,null,null,null,null,null,null,null,null,null,null,null,null,null,null,null,null,null,null,null,null,null,null,null,null,null,null,null,null,""]
[null,null,null,null,null,null,null,null,null,null,null,null,null,null,null,null,null,null,null,null,null,null,null,null,null,null,null,null,null,null,null,""]
[null,null,null,null,null,null,null,null,null,null,null,null,null,null,null,null,null,null,null,null,null,null,null,null,null,null,null,null,null,null,null,{"$f":"+IF(F83<>\"\",+AF82+1,IF(AE83<>\"\",AF82+1,\"\"))","v":""}]
[null,null,null,null,null,null,null,null,null,null,null,null,null,null,null,null,null,null,null,null,null,null,null,null,null,null,null,null,null,null,null,""]
[null,null,null,null,null,null,null,null,null,null,null,null,null,null,null,null,null,null,null,null,null,null,null,null,null,null,null,null,null,null,null,""]
[null,null,null,null,null,null,null,null,null,null,null,null,null,null,null,null,null,null,null,null,null,null,null,null,null,null,null,null,null,null,null,""]
[null,null,null,null,null,null,null,null,null,null,null,null,null,null,null,null,null,null,null,null,null,null,null,null,null,null,null,null,null,null,null,""]
[null,null,null,null,null,null,null,null,null,null,null,null,null,null,null,null,null,null,null,null,null,null,null,null,null,null,null,null,null,null,null,""]
[null,null,null,null,null,null,null,null,null,null,null,null,null,null,null,null,null,null,null,null,null,null,null,null,null,null,null,null,null,null,null,""]
[null,null,null,null,null,null,null,null,null,null,null,null,null,null,null,null,null,null,null,null,null,null,null,null,null,null,null,null,null,null,null,""]
[null,null,null,null,null,null,null,null,null,null,null,null,null,null,null,null,null,null,null,null,null,null,null,null,null,null,null,null,null,null,null,""]
[null,null,null,null,null,null,null,null,null,null,null,null,null,null,null,null,null,null,null,null,null,null,null,null,null,null,null,null,null,null,null,""]
[null,null,null,null,null,null,null,null,null,null,null,null,null,null,null,null,null,null,null,null,null,null,null,null,null,null,null,null,null,null,null,""]
[null,null,null,null,null,null,null,null,null,null,null,null,null,null,null,null,null,null,null,null,null,null,null,null,null,null,null,null,null,null,null,""]
[null,null,null,null,null,null,null,null,null,null,null,null,null,null,null,null,null,null,null,null,null,null,null,null,null,null,null,null,null,null,null,""]
[null,null,null,null,null,null,null,null,null,null,null,null,null,null,null,null,null,null,null,null,null,null,null,null,null,null,null,null,null,null,null,""]
[null,null,null,null,null,null,null,null,null,null,null,null,null,null,null,null,null,null,null,null,null,null,null,null,null,null,null,null,null,null,null,""]
[null,null,null,null,null,null,null,null,null,null,null,null,null,null,null,null,null,null,null,null,null,null,null,null,null,null,null,null,null,null,null,""]
[null,null,null,null,null,null,null,null,null,null,null,null,null,null,null,null,null,null,null,null,null,null,null,null,null,null,null,null,null,null,null,""]
[null,null,null,null,null,null,null,null,null,null,null,null,null,null,null,null,null,null,null,null,null,null,null,null,null,null,null,null,null,null,null,""]
[null,null,null,null,null,null,null,null,null,null,null,null,null,null,null,null,null,null,null,null,null,null,null,null,null,null,null,null,null,null,null,""]
[null,null,null,null,null,null,null,null,null,null,null,null,null,null,null,null,null,null,null,null,null,null,null,null,null,null,null,null,null,null,null,""]
[null,null,null,null,null,null,null,null,null,null,null,null,null,null,null,null,null,null,null,null,null,null,null,null,null,null,null,null,null,null,null,""]
[null,null,null,null,null,null,null,null,null,null,null,null,null,null,null,null,null,null,null,null,null,null,null,null,null,null,null,null,null,null,null,""]
[null,null,null,null,null,null,null,null,null,null,null,null,null,null,null,null,null,null,null,null,null,null,null,null,null,null,null,null,null,null,null,""]
[null,null,null,null,null,null,null,null,null,null,null,null,null,null,null,null,null,null,null,null,null,null,null,null,null,null,null,null,null,null,null,""]
[null,null,null,null,null,null,null,null,null,null,null,null,null,null,null,null,null,null,null,null,null,null,null,null,null,null,null,null,null,null,null,""]
[null,null,null,null,null,null,null,null,null,null,null,null,null,null,null,null,null,null,null,null,null,null,null,null,null,null,null,null,null,null,null,""]
[null,null,null,null,null,null,null,null,null,null,null,null,null,null,null,null,null,null,null,null,null,null,null,null,null,null,null,null,null,null,null,""]
[null,null,null,null,null,null,null,null,null,null,null,null,null,null,null,null,null,null,null,null,null,null,null,null,null,null,null,null,null,null,null,""]
[null,null,null,null,null,null,null,null,null,null,null,null,null,null,null,null,null,null,null,null,null,null,null,null,null,null,null,null,null,null,null,""]
[null,null,null,null,null,null,null,null,null,null,null,null,null,null,null,null,null,null,null,null,null,null,null,null,null,null,null,null,null,null,null,""]
[null,null,null,null,null,null,null,null,null,null,null,null,null,null,null,null,null,null,null,null,null,null,null,null,null,null,null,null,null,null,null,""]
[null,null,null,null,null,null,null,null,null,null,null,null,null,null,null,null,null,null,null,null,null,null,null,null,null,null,null,null,null,null,null,""]
[null,null,null,null,null,null,null,null,null,null,null,null,null,null,null,null,null,null,null,null,null,null,null,null,null,null,null,null,null,null,null,""]
[null,null,null,null,null,null,null,null,null,null,null,null,null,null,null,null,null,null,null,null,null,null,null,null,null,null,null,null,null,null,null,""]
[null,null,null,null,null,null,null,null,null,null,null,null,null,null,null,null,null,null,null,null,null,null,null,null,null,null,null,null,null,null,null,""]